Run of fresh-releases for ruby-redis-store

Try this locally (using silver-platter):

debian-svp new-upstream ruby-redis-store 
1
2
3
4
5
6
7
8
9
10
11
12
13
14
15
16
17
18
19
20
21
22
23
24
25
26
27
28
29
30
31
32
33
34
35
36
37
38
39
40
41
42
43
44
45
46
47
48
49
50
51
52
53
54
55
56
57
58
59
60
61
62
63
64
65
66
67
68
69
70
71
72
73
74
75
76
77
78
79
80
81
82
83
84
85
86
87
88
89
90
91
92
93
94
95
96
97
98
99
100
101
102
103
104
105
106
107
108
109
110
111
112
113
114
115
116
117
118
119
120
121
122
123
124
125
126
127
128
129
130
131
132
133
134
135
136
137
138
139
140
141
142
143
144
145
146
147
148
149
150
151
152
153
154
155
156
157
158
159
160
161
162
163
164
165
166
167
168
169
170
171
172
173
174
175
176
177
178
179
180
181
182
183
184
185
186
187
188
189
190
191
192
193
194
195
196
197
198
199
200
201
202
203
204
205
206
207
208
209
210
211
212
213
214
215
216
217
218
219
220
221
222
223
224
225
226
227
228
229
230
231
232
233
234
235
236
237
238
239
240
241
242
243
244
245
246
247
248
249
250
251
252
253
254
255
256
257
258
259
260
261
262
263
264
265
266
267
268
269
270
271
272
273
274
275
276
277
278
279
280
281
282
Processing: ruby-redis-store
Total 8 (delta 5), reused 0 (delta 0)
All changes applied successfully.
/usr/lib/python3/dist-packages/debian/copyright.py:654: UserWarning: Fixing Format URL
  warnings.warn('Fixing Format URL')
Using upstream branch git://github.com/redis-store/redis-store.git (guessed)
Total 5045 (delta 1), reused 9 (delta 1), pack-reused 5034
uscan warn: redirecting DEPRECATED pkg-ruby-extras.alioth.debian.org/cgi-bin/gemwatch to gemwatch.debian.net
redirecting DEPRECATED pkg-ruby-extras.alioth.debian.org/cgi-bin/gemwatch to gemwatch.debian.net
Using version string 1.8.0.
No upstream upstream-revision format specified, trying tag:1.8.0
No upstream upstream-revision format specified, trying tag:ruby-redis-store-1.8.0
No upstream upstream-revision format specified, trying tag:v1.8.0
Using uscan to look for the upstream tarball.
uscan warn: redirecting DEPRECATED pkg-ruby-extras.alioth.debian.org/cgi-bin/gemwatch to gemwatch.debian.net
redirecting DEPRECATED pkg-ruby-extras.alioth.debian.org/cgi-bin/gemwatch to gemwatch.debian.net
Total 5045 (delta 1), reused 9 (delta 1), pack-reused 5034
v0.3.9 does not point to a valid object
v1.0.0.1 does not point to a valid object
/usr/lib/python3/dist-packages/dulwich/repo.py:415: UserWarning: ref refs/tags/v1.3.0 points at non-present sha f637c5a61c74a7d339ffbb205cd1c125c4f4501f
  UserWarning)
/usr/lib/python3/dist-packages/dulwich/repo.py:415: UserWarning: ref refs/tags/v1.1.5 points at non-present sha 091bd95bd0e83f6da73373e524914583f33bcfe4
  UserWarning)
/usr/lib/python3/dist-packages/dulwich/repo.py:415: UserWarning: ref refs/tags/v1.0.0.beta5 points at non-present sha bd979886955f525550f0a7b7d82f69588f1c0b5b
  UserWarning)
/usr/lib/python3/dist-packages/dulwich/repo.py:415: UserWarning: ref refs/tags/v1.4.1 points at non-present sha 77cb0241983d2ce3a3da01a938cc3cbc2004c39f
  UserWarning)
/usr/lib/python3/dist-packages/dulwich/repo.py:415: UserWarning: ref refs/tags/v0.3.8 points at non-present sha f09aaae973e87c35985593a62ae6e1a6e386f6e0
  UserWarning)
/usr/lib/python3/dist-packages/dulwich/repo.py:415: UserWarning: ref refs/tags/v1.4.0 points at non-present sha d933de28369dc2531ce5be8b88ec2d0b4cba08a5
  UserWarning)
/usr/lib/python3/dist-packages/dulwich/repo.py:415: UserWarning: ref refs/tags/v0.3.0 points at non-present sha 5931a252f64828ca54d0ceb016600603e1c4297e
  UserWarning)
/usr/lib/python3/dist-packages/dulwich/repo.py:415: UserWarning: ref refs/tags/v0.3.6 points at non-present sha f9ec66c288a962d37903334ee54aaf7c0ce717da
  UserWarning)
/usr/lib/python3/dist-packages/dulwich/repo.py:415: UserWarning: ref refs/tags/v0.3.7 points at non-present sha ed9b274a47550a3f35563c0daa01a22268c8c46c
  UserWarning)
/usr/lib/python3/dist-packages/dulwich/repo.py:415: UserWarning: ref refs/tags/v0.2.0 points at non-present sha ab177731953bc31c4b96ec7e2b7601c8e15bc25d
  UserWarning)
/usr/lib/python3/dist-packages/dulwich/repo.py:415: UserWarning: ref refs/tags/v1.6.0 points at non-present sha 0f362f1786b4f3386d20216ea69bbfebe5a50f3a
  UserWarning)
/usr/lib/python3/dist-packages/dulwich/repo.py:415: UserWarning: ref refs/tags/v0.1.0 points at non-present sha f6a5dbc59084fc7ca9a36e457bcda47f539701fe
  UserWarning)
/usr/lib/python3/dist-packages/dulwich/repo.py:415: UserWarning: ref refs/tags/v1.1.0.rc2 points at non-present sha 970fae7c0202304e193468db178887288c1cb44b
  UserWarning)
/usr/lib/python3/dist-packages/dulwich/repo.py:415: UserWarning: ref refs/tags/v1.1.0.rc points at non-present sha be5751f8a47fd2d5e1cd7f2e014434c8efe6defd
  UserWarning)
/usr/lib/python3/dist-packages/dulwich/repo.py:415: UserWarning: ref refs/tags/v1.2.0 points at non-present sha 47141bc7432f5872bb472632bafe49b4804ae811
  UserWarning)
/usr/lib/python3/dist-packages/dulwich/repo.py:415: UserWarning: ref refs/tags/v1.1.6 points at non-present sha 33f3291c9f9e73b48220671c8b74d854ab6fccc1
  UserWarning)
/usr/lib/python3/dist-packages/dulwich/repo.py:415: UserWarning: ref refs/tags/v0.0.2 points at non-present sha 8dfe64505d607ac5aed0f6ec57051198dcf80537
  UserWarning)
/usr/lib/python3/dist-packages/dulwich/repo.py:415: UserWarning: ref refs/tags/v1.0.0.beta2 points at non-present sha 235110087791b9f5bc6e11f6601d8a3ffceaec08
  UserWarning)
/usr/lib/python3/dist-packages/dulwich/repo.py:415: UserWarning: ref refs/tags/v1.1.7 points at non-present sha bda87f2519f41c120e37d1b1e4cf226527347d61
  UserWarning)
/usr/lib/python3/dist-packages/dulwich/repo.py:415: UserWarning: ref refs/tags/v1.2.0.pre points at non-present sha e701db1b76d37cf7fbed941c16bc471f916a6d92
  UserWarning)
/usr/lib/python3/dist-packages/dulwich/repo.py:415: UserWarning: ref refs/tags/v1.0.0.beta3 points at non-present sha 541cad692df761b482782d2ff1c84b53cdd44b95
  UserWarning)
/usr/lib/python3/dist-packages/dulwich/repo.py:415: UserWarning: ref refs/tags/v1.0.0 points at non-present sha aefa26e736c94164c6dae9d30dbbedae9dd16f1f
  UserWarning)
/usr/lib/python3/dist-packages/dulwich/repo.py:415: UserWarning: ref refs/tags/v0.3.5 points at non-present sha 1434efed0c084af010c28752418b683763dea7e1
  UserWarning)
/usr/lib/python3/dist-packages/dulwich/repo.py:415: UserWarning: ref refs/tags/v1.0.0.beta4 points at non-present sha a8081583d1bcfd665944c242bc6bb34a33cfa034
  UserWarning)
/usr/lib/python3/dist-packages/dulwich/repo.py:415: UserWarning: ref refs/tags/v1.1.0 points at non-present sha a424661d308582f4bfbd2ef25dec439dd884cefc
  UserWarning)
/usr/lib/python3/dist-packages/dulwich/repo.py:415: UserWarning: ref refs/tags/v1.5.0 points at non-present sha e385bd65d9a628b5b027b0f863614809a5097fdb
  UserWarning)
/usr/lib/python3/dist-packages/dulwich/repo.py:415: UserWarning: ref refs/tags/v0.0.1 points at non-present sha 7aca5c540d88e87a83deeef57997cfa97beae2e6
  UserWarning)
/usr/lib/python3/dist-packages/dulwich/repo.py:415: UserWarning: ref refs/tags/v0.0.3 points at non-present sha 1547a44341560567b2ac2c8322ad4609fc0bef37
  UserWarning)
/usr/lib/python3/dist-packages/dulwich/repo.py:415: UserWarning: ref refs/tags/v1.0.0.rc1 points at non-present sha df524a01c2cff92444063f285f2653491651347a
  UserWarning)
Not storing pristine-tar metadata, since there is no pristine-tar branch.
/usr/lib/python3/dist-packages/dulwich/repo.py:415: UserWarning: ref refs/tags/v1.3.0 points at non-present sha f637c5a61c74a7d339ffbb205cd1c125c4f4501f
  UserWarning)
/usr/lib/python3/dist-packages/dulwich/repo.py:415: UserWarning: ref refs/tags/v1.1.5 points at non-present sha 091bd95bd0e83f6da73373e524914583f33bcfe4
  UserWarning)
/usr/lib/python3/dist-packages/dulwich/repo.py:415: UserWarning: ref refs/tags/v1.0.0.beta5 points at non-present sha bd979886955f525550f0a7b7d82f69588f1c0b5b
  UserWarning)
/usr/lib/python3/dist-packages/dulwich/repo.py:415: UserWarning: ref refs/tags/v1.4.1 points at non-present sha 77cb0241983d2ce3a3da01a938cc3cbc2004c39f
  UserWarning)
/usr/lib/python3/dist-packages/dulwich/repo.py:415: UserWarning: ref refs/tags/v0.3.8 points at non-present sha f09aaae973e87c35985593a62ae6e1a6e386f6e0
  UserWarning)
/usr/lib/python3/dist-packages/dulwich/repo.py:415: UserWarning: ref refs/tags/v1.4.0 points at non-present sha d933de28369dc2531ce5be8b88ec2d0b4cba08a5
  UserWarning)
/usr/lib/python3/dist-packages/dulwich/repo.py:415: UserWarning: ref refs/tags/v0.3.0 points at non-present sha 5931a252f64828ca54d0ceb016600603e1c4297e
  UserWarning)
/usr/lib/python3/dist-packages/dulwich/repo.py:415: UserWarning: ref refs/tags/v0.3.6 points at non-present sha f9ec66c288a962d37903334ee54aaf7c0ce717da
  UserWarning)
/usr/lib/python3/dist-packages/dulwich/repo.py:415: UserWarning: ref refs/tags/v0.3.7 points at non-present sha ed9b274a47550a3f35563c0daa01a22268c8c46c
  UserWarning)
/usr/lib/python3/dist-packages/dulwich/repo.py:415: UserWarning: ref refs/tags/v0.2.0 points at non-present sha ab177731953bc31c4b96ec7e2b7601c8e15bc25d
  UserWarning)
/usr/lib/python3/dist-packages/dulwich/repo.py:415: UserWarning: ref refs/tags/v1.6.0 points at non-present sha 0f362f1786b4f3386d20216ea69bbfebe5a50f3a
  UserWarning)
/usr/lib/python3/dist-packages/dulwich/repo.py:415: UserWarning: ref refs/tags/v0.1.0 points at non-present sha f6a5dbc59084fc7ca9a36e457bcda47f539701fe
  UserWarning)
/usr/lib/python3/dist-packages/dulwich/repo.py:415: UserWarning: ref refs/tags/v1.1.0.rc2 points at non-present sha 970fae7c0202304e193468db178887288c1cb44b
  UserWarning)
/usr/lib/python3/dist-packages/dulwich/repo.py:415: UserWarning: ref refs/tags/v1.1.0.rc points at non-present sha be5751f8a47fd2d5e1cd7f2e014434c8efe6defd
  UserWarning)
/usr/lib/python3/dist-packages/dulwich/repo.py:415: UserWarning: ref refs/tags/v1.2.0 points at non-present sha 47141bc7432f5872bb472632bafe49b4804ae811
  UserWarning)
/usr/lib/python3/dist-packages/dulwich/repo.py:415: UserWarning: ref refs/tags/v1.1.6 points at non-present sha 33f3291c9f9e73b48220671c8b74d854ab6fccc1
  UserWarning)
/usr/lib/python3/dist-packages/dulwich/repo.py:415: UserWarning: ref refs/tags/v0.0.2 points at non-present sha 8dfe64505d607ac5aed0f6ec57051198dcf80537
  UserWarning)
/usr/lib/python3/dist-packages/dulwich/repo.py:415: UserWarning: ref refs/tags/v1.0.0.beta2 points at non-present sha 235110087791b9f5bc6e11f6601d8a3ffceaec08
  UserWarning)
/usr/lib/python3/dist-packages/dulwich/repo.py:415: UserWarning: ref refs/tags/v1.1.7 points at non-present sha bda87f2519f41c120e37d1b1e4cf226527347d61
  UserWarning)
/usr/lib/python3/dist-packages/dulwich/repo.py:415: UserWarning: ref refs/tags/v1.2.0.pre points at non-present sha e701db1b76d37cf7fbed941c16bc471f916a6d92
  UserWarning)
/usr/lib/python3/dist-packages/dulwich/repo.py:415: UserWarning: ref refs/tags/v1.0.0.beta3 points at non-present sha 541cad692df761b482782d2ff1c84b53cdd44b95
  UserWarning)
/usr/lib/python3/dist-packages/dulwich/repo.py:415: UserWarning: ref refs/tags/v1.0.0 points at non-present sha aefa26e736c94164c6dae9d30dbbedae9dd16f1f
  UserWarning)
/usr/lib/python3/dist-packages/dulwich/repo.py:415: UserWarning: ref refs/tags/v0.3.5 points at non-present sha 1434efed0c084af010c28752418b683763dea7e1
  UserWarning)
/usr/lib/python3/dist-packages/dulwich/repo.py:415: UserWarning: ref refs/tags/v1.0.0.beta4 points at non-present sha a8081583d1bcfd665944c242bc6bb34a33cfa034
  UserWarning)
/usr/lib/python3/dist-packages/dulwich/repo.py:415: UserWarning: ref refs/tags/v1.1.0 points at non-present sha a424661d308582f4bfbd2ef25dec439dd884cefc
  UserWarning)
/usr/lib/python3/dist-packages/dulwich/repo.py:415: UserWarning: ref refs/tags/v1.5.0 points at non-present sha e385bd65d9a628b5b027b0f863614809a5097fdb
  UserWarning)
/usr/lib/python3/dist-packages/dulwich/repo.py:415: UserWarning: ref refs/tags/v0.0.1 points at non-present sha 7aca5c540d88e87a83deeef57997cfa97beae2e6
  UserWarning)
/usr/lib/python3/dist-packages/dulwich/repo.py:415: UserWarning: ref refs/tags/v0.0.3 points at non-present sha 1547a44341560567b2ac2c8322ad4609fc0bef37
  UserWarning)
/usr/lib/python3/dist-packages/dulwich/repo.py:415: UserWarning: ref refs/tags/v1.0.0.rc1 points at non-present sha df524a01c2cff92444063f285f2653491651347a
  UserWarning)
v1.3.0 does not point to a valid object
v1.1.5 does not point to a valid object
v1.0.0.beta5 does not point to a valid object
v1.4.1 does not point to a valid object
v0.3.8 does not point to a valid object
v1.4.0 does not point to a valid object
v0.3.0 does not point to a valid object
v0.3.6 does not point to a valid object
v0.3.7 does not point to a valid object
v0.2.0 does not point to a valid object
v1.6.0 does not point to a valid object
v0.1.0 does not point to a valid object
v1.1.0.rc2 does not point to a valid object
v1.1.0.rc does not point to a valid object
v1.2.0 does not point to a valid object
v1.1.6 does not point to a valid object
v0.0.2 does not point to a valid object
v1.0.0.beta2 does not point to a valid object
v1.1.7 does not point to a valid object
v1.2.0.pre does not point to a valid object
v1.0.0.beta3 does not point to a valid object
v1.0.0 does not point to a valid object
v0.3.5 does not point to a valid object
v1.0.0.beta4 does not point to a valid object
v1.1.0 does not point to a valid object
v1.5.0 does not point to a valid object
v0.0.1 does not point to a valid object
v0.0.3 does not point to a valid object
v1.0.0.rc1 does not point to a valid object
All changes applied successfully.
v1.3.0 does not point to a valid object
v1.1.5 does not point to a valid object
v1.0.0.beta5 does not point to a valid object
v1.4.1 does not point to a valid object
v0.3.8 does not point to a valid object
v1.4.0 does not point to a valid object
v0.3.0 does not point to a valid object
v0.3.6 does not point to a valid object
v0.3.7 does not point to a valid object
v0.2.0 does not point to a valid object
v1.6.0 does not point to a valid object
v0.1.0 does not point to a valid object
v1.1.0.rc2 does not point to a valid object
v1.1.0.rc does not point to a valid object
v1.2.0 does not point to a valid object
v1.1.6 does not point to a valid object
v0.0.2 does not point to a valid object
v1.0.0.beta2 does not point to a valid object
v1.1.7 does not point to a valid object
v1.2.0.pre does not point to a valid object
v1.0.0.beta3 does not point to a valid object
v1.0.0 does not point to a valid object
v0.3.5 does not point to a valid object
v1.0.0.beta4 does not point to a valid object
v1.1.0 does not point to a valid object
v1.5.0 does not point to a valid object
v0.0.1 does not point to a valid object
v0.0.3 does not point to a valid object
v1.0.0.rc1 does not point to a valid object
Committing to: /home/janitor/tmp/tmpjcs_d1bu/ruby-redis-store/
added .codeclimate.yml
added .github
added .github/auto-assign-issues.yml
modified .gitignore
added .rubocop.yml
modified .travis.yml
added Appraisals
deleted CHANGELOG
added CHANGELOG.md
added CODEOWNERS
modified Gemfile
modified README.md
modified Rakefile
modified debian/changelog
added gemfiles
added gemfiles/redis_3_x.gemfile
added gemfiles/redis_4_x.gemfile
modified lib/redis/distributed_store.rb
modified lib/redis/store/factory.rb
deleted lib/redis/store/marshalling.rb
modified lib/redis/store/namespace.rb
modified lib/redis/store/redis_version.rb
added lib/redis/store/serialization.rb
modified lib/redis/store/ttl.rb
modified lib/redis/store/version.rb
modified lib/redis/store.rb
modified lib/redis-store.rb
modified redis-store.gemspec
modified test/redis/distributed_store_test.rb
modified test/redis/store/factory_test.rb
modified test/redis/store/interface_test.rb
deleted test/redis/store/marshalling_test.rb
modified test/redis/store/namespace_test.rb
modified test/redis/store/redis_version_test.rb
added test/redis/store/serialization_test.rb
modified test/redis/store/ttl_test.rb
modified test/test_helper.rb
Committed revision 29.
Worker failed: An error occurred refreshing quilt patch CVE-2017-1000248.patch: 

Applying patch debian/patches/CVE-2017-1000248.patch
patching file lib/redis-store.rb
Hunk #1 FAILED at 1.
1 out of 1 hunk FAILED -- rejects in file lib/redis-store.rb
patching file lib/redis/store.rb
Hunk #1 FAILED at 1.
Hunk #2 FAILED at 8.
Hunk #3 FAILED at 23.
3 out of 3 hunks FAILED -- rejects in file lib/redis/store.rb
patching file lib/redis/store/factory.rb
Hunk #1 FAILED at 50.
1 out of 1 hunk FAILED -- rejects in file lib/redis/store/factory.rb
patching file lib/redis/store/namespace.rb
Hunk #1 FAILED at 46.
1 out of 1 hunk FAILED -- rejects in file lib/redis/store/namespace.rb
The next patch would delete the file lib/redis/store/marshalling.rb,
which does not exist!  Applying it anyway.
patching file lib/redis/store/marshalling.rb
Hunk #1 FAILED at 1.
1 out of 1 hunk FAILED -- rejects in file lib/redis/store/marshalling.rb
The next patch would create the file lib/redis/store/serialization.rb,
which already exists!  Applying it anyway.
patching file lib/redis/store/serialization.rb
Hunk #1 FAILED at 1.
1 out of 1 hunk FAILED -- rejects in file lib/redis/store/serialization.rb
patching file test/redis/store/factory_test.rb
Hunk #1 FAILED at 1.
Hunk #2 FAILED at 41.
2 out of 2 hunks FAILED -- rejects in file test/redis/store/factory_test.rb
patching file test/redis/store/namespace_test.rb
Hunk #1 FAILED at 3.
Hunk #2 FAILED at 90.
2 out of 2 hunks FAILED -- rejects in file test/redis/store/namespace_test.rb
The next patch would delete the file test/redis/store/marshalling_test.rb,
which does not exist!  Applying it anyway.
patching file test/redis/store/marshalling_test.rb
Hunk #1 FAILED at 1.
1 out of 1 hunk FAILED -- rejects in file test/redis/store/marshalling_test.rb
The next patch would create the file test/redis/store/serialization_test.rb,
which already exists!  Applying it anyway.
patching file test/redis/store/serialization_test.rb
Hunk #1 FAILED at 1.
1 out of 1 hunk FAILED -- rejects in file test/redis/store/serialization_test.rb
Patch debian/patches/CVE-2017-1000248.patch does not apply (enforce with -f)

Elapsed time: 0:01:18.760585

Full worker log