Run of fresh-releases for ruby-rubocop-ast

Try this locally (using silver-platter):

debian-svp new-upstream ruby-rubocop-ast 
11
12
13
14
15
16
17
18
19
20
21
dpkg-source: info: using patch list from debian/patches/series
patching file rubocop-ast.gemspec
Hunk #1 FAILED at 14.
1 out of 1 hunk FAILED
dpkg-source: info: the patch has fuzz which is not allowed, or is malformed
dpkg-source: info: if patch '0001-gemspec-drop-git-usage.patch' is correctly applied by quilt, use 'quilt refresh' to update it
dpkg-source: error: LC_ALL=C patch -t -F 0 -N -p1 -u -V never -E -b -B .pc/0001-gemspec-drop-git-usage.patch/ --reject-file=- < ruby-rubocop-ast-1.4.1.orig.vD2REb/debian/patches/0001-gemspec-drop-git-usage.patch subprocess returned exit status 1
E: Failed to open build log /tmp/tmpcj3tw49u/build-area//tmp/tmpcj3tw49u/build-area/ruby-rubocop-ast_1.4.1-1~jan+nur1.dsc_amd64-2021-03-27T14:04:39Z.build: No such file or directory
print() on closed filehandle $PLOG at /usr/share/perl5/Sbuild/Base.pm line 90.
E: unable to mktemp
brz: ERROR: The build failed.

Summary

Merged new upstream version: 1.4.1 (was: 0.3.0+dfsg).

Full worker log Full build log