Run of fresh-snapshots for ruby-test-unit

Try this locally (using silver-platter):

debian-svp new-upstream --snapshot ruby-test-unit 
84
85
86
87
88
89
90
91
92
93
dpkg-source: error: cannot represent change to doc/html/reference.png: binary file contents changed
dpkg-source: error: add doc/html/reference.png in debian/source/include-binaries if you want to store the modified binary in the debian tarball
dpkg-source: error: cannot represent change to doc/html/tango-logo.png: binary file contents changed
dpkg-source: error: add doc/html/tango-logo.png in debian/source/include-binaries if you want to store the modified binary in the debian tarball
dpkg-source: error: cannot represent change to doc/html/tutorial.png: binary file contents changed
dpkg-source: error: add doc/html/tutorial.png in debian/source/include-binaries if you want to store the modified binary in the debian tarball
dpkg-source: error: cannot represent change to doc/html/us.png: binary file contents changed
dpkg-source: error: add doc/html/us.png in debian/source/include-binaries if you want to store the modified binary in the debian tarball
E: Failed to package source directory /home/janitor/tmp/tmpm2qqmu0a/build-area/ruby-test-unit-3.3.5
brz: ERROR: The build failed.

Summary

Merged new upstream version: 3.3.6+git20201113.1516068 (was: 3.3.5).

Full worker log Full build log