Run of fresh-releases for scalene

Try this locally (using silver-platter):

debian-svp new-upstream scalene 
15
16
17
18
19
20
21
22
23
24
25
26
dpkg-source: warning: ignoring deletion of file test/testme1.py, use --include-removal to override
dpkg-source: warning: file scalene-0.7.5/include/libdivide.h has no final newline (either original or modified version)
dpkg-source: warning: file scalene-0.7.5/include/rtememcpy.h has no final newline (either original or modified version)
dpkg-source: error: cannot represent change to scalene/libscalene.dylib: binary file contents changed
dpkg-source: error: add scalene/libscalene.dylib in debian/source/include-binaries if you want to store the modified binary in the debian tarball
dpkg-source: warning: executable mode 0755 of 'scalene/libscalene.dylib' will not be represented in diff
dpkg-source: error: cannot represent change to scalene/libscalene.so: binary file contents changed
dpkg-source: error: add scalene/libscalene.so in debian/source/include-binaries if you want to store the modified binary in the debian tarball
dpkg-source: warning: executable mode 0755 of 'scalene/libscalene.so' will not be represented in diff
dpkg-source: warning: file scalene-0.7.5/test/testkeras.py has no final newline (either original or modified version)
E: Failed to package source directory /home/janitor/tmp/tmp25868z0i/build-area/scalene-0.7.5
brz: ERROR: The build failed.

Summary

Merged new upstream version: 1.1.10 (was: 0.7.5).

Full worker log Full build log