Run of fresh-snapshots for snowball

Try this locally (using silver-platter):

debian-svp new-upstream --snapshot snowball 
854
855
856
857
858
859
860
861
862
863
864
865
866
867
868
cp doc/libstemmer_python_README ${dest}/README.rst && \
cp -a python_out/arabic_stemmer.py python_out/armenian_stemmer.py python_out/basque_stemmer.py python_out/catalan_stemmer.py python_out/danish_stemmer.py python_out/dutch_stemmer.py python_out/english_stemmer.py python_out/finnish_stemmer.py python_out/french_stemmer.py python_out/german_stemmer.py python_out/greek_stemmer.py python_out/hindi_stemmer.py python_out/hungarian_stemmer.py python_out/indonesian_stemmer.py python_out/irish_stemmer.py python_out/italian_stemmer.py python_out/lithuanian_stemmer.py python_out/nepali_stemmer.py python_out/norwegian_stemmer.py python_out/porter_stemmer.py python_out/portuguese_stemmer.py python_out/romanian_stemmer.py python_out/russian_stemmer.py python_out/serbian_stemmer.py python_out/spanish_stemmer.py python_out/swedish_stemmer.py python_out/tamil_stemmer.py python_out/turkish_stemmer.py python_out/yiddish_stemmer.py python_out/__init__.py ${dest}/src/snowballstemmer && \
cp -a python/testapp.py python/stemwords.py ${dest}/src/sample && \
cp -a python/snowballstemmer/basestemmer.py python/snowballstemmer/among.py ${dest}/src/snowballstemmer && \
cp -a COPYING NEWS python/MANIFEST.in python/setup.py python/setup.cfg ${dest}
make[2]: Leaving directory '/<<PKGBUILDDIR>>'
dh_auto_build --buildsystem=pybuild -- --dir dist/snowballstemmer-2.1.0+git20210310.8b49140 --name snowballstemmer
E: pybuild pybuild:111: cannot detect build system, please use --system option or set PYBUILD_SYSTEM env. variable
dh_auto_build: error: pybuild --build -i python{version} -p 3.9 --dir dist/snowballstemmer-2.1.0\+git20210310.8b49140 --name snowballstemmer returned exit code 11
make[1]: *** [debian/rules:11: override_dh_auto_build] Error 25
make[1]: Leaving directory '/<<PKGBUILDDIR>>'
make: *** [debian/rules:6: binary] Error 2
dpkg-buildpackage: error: debian/rules binary subprocess returned exit status 2
--------------------------------------------------------------------------------
Build finished at 2021-03-26T16:38:28Z

Summary

Merged new upstream version: 2.1.0+git20210310.8b49140 (was: 2.1.0).

Full worker log Full build log Full dist log