Run of fresh-releases for sphinx-autorun

Try this locally (using silver-platter):

debian-svp new-upstream sphinx-autorun 
11
12
13
14
15
16
17
18
19
20
21
dpkg-source: info: using patch list from debian/patches/series
patching file sphinx_autorun/__init__.py
Hunk #1 FAILED at 25.
1 out of 1 hunk FAILED
dpkg-source: info: the patch has fuzz which is not allowed, or is malformed
dpkg-source: info: if patch '0001-use-python3-instead-of-python.patch' is correctly applied by quilt, use 'quilt refresh' to update it
dpkg-source: error: LC_ALL=C patch -t -F 0 -N -p1 -u -V never -E -b -B .pc/0001-use-python3-instead-of-python.patch/ --reject-file=- < sphinx-autorun-1.1.1.orig.5wkb7a/debian/patches/0001-use-python3-instead-of-python.patch subprocess returned exit status 1
E: Failed to open build log /tmp/tmpgbmqmb2u/build-area//tmp/tmpgbmqmb2u/build-area/sphinx-autorun_1.1.1-1~jan+nur1.dsc_amd64-2021-03-27T14:18:15Z.build: No such file or directory
print() on closed filehandle $PLOG at /usr/share/perl5/Sbuild/Base.pm line 90.
E: unable to mktemp
brz: ERROR: The build failed.

Summary

Merged new upstream version: 1.1.1 (was: 1.1.0).

Full worker log Full build log