Run of fresh-snapshots for straight.plugin

Try this locally (using silver-platter):

debian-svp new-upstream --snapshot straight.plugin 
758
759
760
761
762
763
764
765
766
767
768
769
770
771
772
copying straight/plugin/__init__.py -> /<<PKGBUILDDIR>>/.pybuild/cpython3_3.9_straight.plugin/build/straight/plugin
copying straight/plugin/loaders.py -> /<<PKGBUILDDIR>>/.pybuild/cpython3_3.9_straight.plugin/build/straight/plugin
copying straight/plugin/manager.py -> /<<PKGBUILDDIR>>/.pybuild/cpython3_3.9_straight.plugin/build/straight/plugin
PYTHONPATH=../ /usr/bin/make -C docs/ html man
make[2]: Entering directory '/<<PKGBUILDDIR>>'
make[2]: *** docs/: No such file or directory.  Stop.
make[2]: Leaving directory '/<<PKGBUILDDIR>>'
make[1]: *** [debian/rules:10: override_dh_auto_build] Error 2
make[1]: Leaving directory '/<<PKGBUILDDIR>>'
make: *** [debian/rules:6: build] Error 2
dpkg-buildpackage: error: debian/rules build subprocess returned exit status 2
--------------------------------------------------------------------------------
Build finished at 2021-04-08T18:10:28Z

Finished

Summary

Merged new upstream version: 1.4.1+git20210203.1.363b0af (was: 1.4.1).

Full worker log Full build log Full dist log