Run of fresh-snapshots for tuxonice-userui

Try this locally (using silver-platter):

debian-svp new-upstream --snapshot tuxonice-userui 
1
2
3
4
5
6
7
8
9
10
11
12
13
14
15
16
17
18
19
20
21
22
23
24
25
26
27
28
29
30
31
32
33
34
35
36
37
38
39
40
41
42
43
44
45
46
47
48
49
50
51
52
53
54
55
56
57
58
59
60
61
62
63
64
65
66
67
68
69
70
71
72
73
74
75
76
77
78
79
80
81
82
83
84
85
86
87
88
89
90
91
92
93
94
95
96
97
98
99
100
101
102
103
104
105
106
107
108
109
110
111
112
113
114
115
116
117
118
119
120
121
122
123
124
125
126
127
128
129
130
131
132
133
134
135
136
137
138
139
140
141
142
143
144
145
146
147
148
149
150
151
152
153
154
155
156
157
158
159
160
161
162
163
164
165
166
167
168
169
170
171
172
173
174
175
176
177
178
179
180
181
182
183
184
185
186
187
188
189
190
191
192
193
194
195
196
197
198
199
Processing: tuxonice-userui
Total 6774 (delta 3664), reused 6720 (delta 3641)
Total 24 (delta 5), reused 18 (delta 3)
Using upstream branch https://gitlab.com/nigelcunningham/Tuxonice-Userui (guessed)
https://gitlab.com/nigelcunningham/Tuxonice-Userui/ is permanently redirected to https://gitlab.com/nigelcunningham/Tuxonice-Userui.git/
35)
Total 110 (delta 81), reused 38 (delta 26)
Using version string 1.1+dfsg1.gc3bdd83+git20190816.baa36ec.
Exporting upstream branch revision b'git-v1:baa36ec7d33817c472347262a76bc2202f5cdcb2' to create the tarball
35)
Total 110 (delta 81), reused 38 (delta 26)
/usr/lib/python3/dist-packages/dulwich/repo.py:415: UserWarning: ref refs/tags/v0.4.0 points at non-present sha bb87eac527f17311c3b19dfe6d82f005a617b0a9
  UserWarning)
/usr/lib/python3/dist-packages/dulwich/repo.py:415: UserWarning: ref refs/tags/v0.6.4 points at non-present sha 377922bc0c815bec3c42bf451e8cc1abb2289b3a
  UserWarning)
/usr/lib/python3/dist-packages/dulwich/repo.py:415: UserWarning: ref refs/tags/v0.7.2 points at non-present sha 3368fcb0b75d0732bae07824e9ba7c8834eff1b8
  UserWarning)
/usr/lib/python3/dist-packages/dulwich/repo.py:415: UserWarning: ref refs/tags/v1.0 points at non-present sha 03edbb963424c49fdaf552720136cc44681e667a
  UserWarning)
/usr/lib/python3/dist-packages/dulwich/repo.py:415: UserWarning: ref refs/tags/v0.5.3 points at non-present sha d30705ab698b9e8f33f2ded14081ecfa182548bf
  UserWarning)
/usr/lib/python3/dist-packages/dulwich/repo.py:415: UserWarning: ref refs/tags/v0.1.03 points at non-present sha 1ae5924bd3a23b163d1368570137af684683b1b5
  UserWarning)
/usr/lib/python3/dist-packages/dulwich/repo.py:415: UserWarning: ref refs/tags/v0.1.05 points at non-present sha 53f1745e62f233e0a108b708a0655230d9f82df5
  UserWarning)
/usr/lib/python3/dist-packages/dulwich/repo.py:415: UserWarning: ref refs/tags/v0.5.0 points at non-present sha 95ca8f711dc8d4c6b16674f7fccc631b5ba7b161
  UserWarning)
/usr/lib/python3/dist-packages/dulwich/repo.py:415: UserWarning: ref refs/tags/v0.7.1 points at non-present sha 8d22009f7a5724e4d11682fcfba9eedc0b0de35f
  UserWarning)
/usr/lib/python3/dist-packages/dulwich/repo.py:415: UserWarning: ref refs/tags/v0.1.01-rc1 points at non-present sha 3921bdc6aef032280e04f3b898464e0b7e64a2b8
  UserWarning)
/usr/lib/python3/dist-packages/dulwich/repo.py:415: UserWarning: ref refs/tags/v0.6.3 points at non-present sha 3d3cc67226d3351e38fd1af8f6f346e582695628
  UserWarning)
/usr/lib/python3/dist-packages/dulwich/repo.py:415: UserWarning: ref refs/tags/v0.1.00-rc1 points at non-present sha 61a269f110f418e4444e083940aac8050dffabbe
  UserWarning)
/usr/lib/python3/dist-packages/dulwich/repo.py:415: UserWarning: ref refs/tags/v0.3.0 points at non-present sha 255319b4091a0b144da82afdcedd263654d67954
  UserWarning)
/usr/lib/python3/dist-packages/dulwich/repo.py:415: UserWarning: ref refs/tags/v0.1.02 points at non-present sha b1a67abdbeb90827be50431b9830a9357433e6c9
  UserWarning)
/usr/lib/python3/dist-packages/dulwich/repo.py:415: UserWarning: ref refs/tags/v0.3.1 points at non-present sha 650bf8a8e09a2f946e541106f260b2368d68e13e
  UserWarning)
/usr/lib/python3/dist-packages/dulwich/repo.py:415: UserWarning: ref refs/tags/v0.6.0 points at non-present sha 32a91b53cf7c94f86709845190b5563348180e92
  UserWarning)
/usr/lib/python3/dist-packages/dulwich/repo.py:415: UserWarning: ref refs/tags/v0.7.0 points at non-present sha 11acd5c8160e6b5a77df030bce161c7600989e17
  UserWarning)
/usr/lib/python3/dist-packages/dulwich/repo.py:415: UserWarning: ref refs/tags/v0.1.04 points at non-present sha 51a2e35da0d5ba6a36f669f7c1c7d39e9d7c7a0c
  UserWarning)
/usr/lib/python3/dist-packages/dulwich/repo.py:415: UserWarning: ref refs/tags/v0.1.01 points at non-present sha 69e7f4d441e79bdddc1d85eb980023623366376e
  UserWarning)
/usr/lib/python3/dist-packages/dulwich/repo.py:415: UserWarning: ref refs/tags/v0.7.3 points at non-present sha d126f20fffa163f0276af010961135cc904bd933
  UserWarning)
/usr/lib/python3/dist-packages/dulwich/repo.py:415: UserWarning: ref refs/tags/v0.5.2 points at non-present sha d080c229f3f639427c33da35daf5815a4da7f73e
  UserWarning)
/usr/lib/python3/dist-packages/dulwich/repo.py:415: UserWarning: ref refs/tags/v0.6.1 points at non-present sha 589cdec736a4c647b688f7a8de569a0d25dde03d
  UserWarning)
/usr/lib/python3/dist-packages/dulwich/repo.py:415: UserWarning: ref refs/tags/v0.5.1 points at non-present sha 9292fa76249b7410dbf97636f10d4279c627a936
  UserWarning)
/usr/lib/python3/dist-packages/dulwich/repo.py:415: UserWarning: ref refs/tags/v0.6.2 points at non-present sha d0d0b3a23cc0a77f1f2a2f66507f24078304867b
  UserWarning)
/usr/lib/python3/dist-packages/dulwich/repo.py:415: UserWarning: ref refs/tags/v0.1.00-rc2 points at non-present sha 6abc6f6444985e8ca92c6aa32d64c6316dea02c9
  UserWarning)
/usr/lib/python3/dist-packages/dulwich/repo.py:415: UserWarning: ref refs/tags/v0.4.0 points at non-present sha bb87eac527f17311c3b19dfe6d82f005a617b0a9
  UserWarning)
/usr/lib/python3/dist-packages/dulwich/repo.py:415: UserWarning: ref refs/tags/v0.6.4 points at non-present sha 377922bc0c815bec3c42bf451e8cc1abb2289b3a
  UserWarning)
/usr/lib/python3/dist-packages/dulwich/repo.py:415: UserWarning: ref refs/tags/v0.7.2 points at non-present sha 3368fcb0b75d0732bae07824e9ba7c8834eff1b8
  UserWarning)
/usr/lib/python3/dist-packages/dulwich/repo.py:415: UserWarning: ref refs/tags/v1.0 points at non-present sha 03edbb963424c49fdaf552720136cc44681e667a
  UserWarning)
/usr/lib/python3/dist-packages/dulwich/repo.py:415: UserWarning: ref refs/tags/v0.5.3 points at non-present sha d30705ab698b9e8f33f2ded14081ecfa182548bf
  UserWarning)
/usr/lib/python3/dist-packages/dulwich/repo.py:415: UserWarning: ref refs/tags/v0.1.03 points at non-present sha 1ae5924bd3a23b163d1368570137af684683b1b5
  UserWarning)
/usr/lib/python3/dist-packages/dulwich/repo.py:415: UserWarning: ref refs/tags/v0.1.05 points at non-present sha 53f1745e62f233e0a108b708a0655230d9f82df5
  UserWarning)
/usr/lib/python3/dist-packages/dulwich/repo.py:415: UserWarning: ref refs/tags/v0.5.0 points at non-present sha 95ca8f711dc8d4c6b16674f7fccc631b5ba7b161
  UserWarning)
/usr/lib/python3/dist-packages/dulwich/repo.py:415: UserWarning: ref refs/tags/v0.7.1 points at non-present sha 8d22009f7a5724e4d11682fcfba9eedc0b0de35f
  UserWarning)
/usr/lib/python3/dist-packages/dulwich/repo.py:415: UserWarning: ref refs/tags/v0.1.01-rc1 points at non-present sha 3921bdc6aef032280e04f3b898464e0b7e64a2b8
  UserWarning)
/usr/lib/python3/dist-packages/dulwich/repo.py:415: UserWarning: ref refs/tags/v0.6.3 points at non-present sha 3d3cc67226d3351e38fd1af8f6f346e582695628
  UserWarning)
/usr/lib/python3/dist-packages/dulwich/repo.py:415: UserWarning: ref refs/tags/v0.1.00-rc1 points at non-present sha 61a269f110f418e4444e083940aac8050dffabbe
  UserWarning)
/usr/lib/python3/dist-packages/dulwich/repo.py:415: UserWarning: ref refs/tags/v0.3.0 points at non-present sha 255319b4091a0b144da82afdcedd263654d67954
  UserWarning)
/usr/lib/python3/dist-packages/dulwich/repo.py:415: UserWarning: ref refs/tags/v0.1.02 points at non-present sha b1a67abdbeb90827be50431b9830a9357433e6c9
  UserWarning)
/usr/lib/python3/dist-packages/dulwich/repo.py:415: UserWarning: ref refs/tags/v0.3.1 points at non-present sha 650bf8a8e09a2f946e541106f260b2368d68e13e
  UserWarning)
/usr/lib/python3/dist-packages/dulwich/repo.py:415: UserWarning: ref refs/tags/v0.6.0 points at non-present sha 32a91b53cf7c94f86709845190b5563348180e92
  UserWarning)
/usr/lib/python3/dist-packages/dulwich/repo.py:415: UserWarning: ref refs/tags/v0.7.0 points at non-present sha 11acd5c8160e6b5a77df030bce161c7600989e17
  UserWarning)
/usr/lib/python3/dist-packages/dulwich/repo.py:415: UserWarning: ref refs/tags/v0.1.04 points at non-present sha 51a2e35da0d5ba6a36f669f7c1c7d39e9d7c7a0c
  UserWarning)
/usr/lib/python3/dist-packages/dulwich/repo.py:415: UserWarning: ref refs/tags/v0.1.01 points at non-present sha 69e7f4d441e79bdddc1d85eb980023623366376e
  UserWarning)
/usr/lib/python3/dist-packages/dulwich/repo.py:415: UserWarning: ref refs/tags/v0.7.3 points at non-present sha d126f20fffa163f0276af010961135cc904bd933
  UserWarning)
/usr/lib/python3/dist-packages/dulwich/repo.py:415: UserWarning: ref refs/tags/v0.5.2 points at non-present sha d080c229f3f639427c33da35daf5815a4da7f73e
  UserWarning)
/usr/lib/python3/dist-packages/dulwich/repo.py:415: UserWarning: ref refs/tags/v0.6.1 points at non-present sha 589cdec736a4c647b688f7a8de569a0d25dde03d
  UserWarning)
/usr/lib/python3/dist-packages/dulwich/repo.py:415: UserWarning: ref refs/tags/v0.5.1 points at non-present sha 9292fa76249b7410dbf97636f10d4279c627a936
  UserWarning)
/usr/lib/python3/dist-packages/dulwich/repo.py:415: UserWarning: ref refs/tags/v0.6.2 points at non-present sha d0d0b3a23cc0a77f1f2a2f66507f24078304867b
  UserWarning)
/usr/lib/python3/dist-packages/dulwich/repo.py:415: UserWarning: ref refs/tags/v0.1.00-rc2 points at non-present sha 6abc6f6444985e8ca92c6aa32d64c6316dea02c9
  UserWarning)
v0.4.0 does not point to a valid object
v0.6.4 does not point to a valid object
v0.7.2 does not point to a valid object
v1.0 does not point to a valid object
v0.5.3 does not point to a valid object
v0.1.03 does not point to a valid object
v0.1.05 does not point to a valid object
v0.5.0 does not point to a valid object
v0.7.1 does not point to a valid object
v0.1.01-rc1 does not point to a valid object
v0.6.3 does not point to a valid object
v0.1.00-rc1 does not point to a valid object
v0.3.0 does not point to a valid object
v0.1.02 does not point to a valid object
v0.3.1 does not point to a valid object
v0.6.0 does not point to a valid object
v0.7.0 does not point to a valid object
v0.1.04 does not point to a valid object
v0.1.01 does not point to a valid object
v0.7.3 does not point to a valid object
v0.5.2 does not point to a valid object
v0.6.1 does not point to a valid object
v0.5.1 does not point to a valid object
v0.6.2 does not point to a valid object
v0.1.00-rc2 does not point to a valid object
All changes applied successfully.
v0.4.0 does not point to a valid object
v0.6.4 does not point to a valid object
v0.7.2 does not point to a valid object
v1.0 does not point to a valid object
v0.5.3 does not point to a valid object
v0.1.03 does not point to a valid object
v0.1.05 does not point to a valid object
v0.5.0 does not point to a valid object
v0.7.1 does not point to a valid object
v0.1.01-rc1 does not point to a valid object
v0.6.3 does not point to a valid object
v0.1.00-rc1 does not point to a valid object
v0.3.0 does not point to a valid object
v0.1.02 does not point to a valid object
v0.3.1 does not point to a valid object
v0.6.0 does not point to a valid object
v0.7.0 does not point to a valid object
v0.1.04 does not point to a valid object
v0.1.01 does not point to a valid object
v0.7.3 does not point to a valid object
v0.5.2 does not point to a valid object
v0.6.1 does not point to a valid object
v0.5.1 does not point to a valid object
v0.6.2 does not point to a valid object
v0.1.00-rc2 does not point to a valid object
Committing to: /home/janitor/tmp/tmpra6cabst/tuxonice-userui/
modified debian/changelog
modified fbsplash/cmd.c
modified fbsplash/common.c
modified fbsplash/effects.c
modified fbsplash/image.c
modified fbsplash/linux/console_splash.h
modified fbsplash/linux/fb.h
modified fbsplash/list.c
modified fbsplash/mng_callbacks.c
modified fbsplash/mng_render.c
modified fbsplash/mng_splash.h
modified fbsplash/parse.c
modified fbsplash/render.c
modified fbsplash/splash.h
modified fbsplash/ttf.c
modified fbsplash/ttf.h
modified fbsplash/userui_fbsplash_core.c
modified suspend_userui.h
deleted textui-only.patch
modified userui.h
deleted userui.patch
modified userui_core.c
modified userui_text.c
Committed revision 83.
Worker failed: An error occurred refreshing quilt patch 0002-Fix-includes-for-recent-freetype-versions.patch: 

Applying patch debian/patches/0002-Fix-includes-for-recent-freetype-versions.patch
patching file fbsplash/ttf.c
Hunk #1 FAILED at 25.
1 out of 1 hunk FAILED -- rejects in file fbsplash/ttf.c
patching file fbsplash/ttf.h
Hunk #1 FAILED at 1.
1 out of 1 hunk FAILED -- rejects in file fbsplash/ttf.h
Patch debian/patches/0002-Fix-includes-for-recent-freetype-versions.patch does not apply (enforce with -f)

Elapsed time: 0:01:51.128529

Full worker log