Run of multiarch-fixes for vibe.d

Try this locally (using the lintian-brush package):

debcheckout vibe.d
cd vibe.d
apply-multiarch-hints
1354
1355
1356
1357
1358
1359
1360
1361
1362
1363
1364
1365
1366
1367
1368
1369
../web/vibe/web/rest.d(1440): Deprecation: function std.typecons.Nullable!string.Nullable.get_ is deprecated - Implicit conversion with alias Nullable.get this will be removed after 2.096. Please use .get explicitly.
../web/vibe/web/rest.d(1440): Deprecation: function std.typecons.Nullable!ulong.Nullable.get_ is deprecated - Implicit conversion with alias Nullable.get this will be removed after 2.096. Please use .get explicitly.
../utils/vibe/utils/dictionarylist.d(77): Deprecation: alias byKeyValue this is deprecated - Iterate over .byKeyValue instead.
../utils/vibe/utils/dictionarylist.d(77): Deprecation: alias byKeyValue this is deprecated - Iterate over .byKeyValue instead.
../utils/vibe/utils/dictionarylist.d(77): Deprecation: alias byKeyValue this is deprecated - Iterate over .byKeyValue instead.
../utils/vibe/utils/dictionarylist.d(77): Deprecation: alias byKeyValue this is deprecated - Iterate over .byKeyValue instead.
/usr/lib/ldc/x86_64-linux-gnu/include/d/std/range/primitives.d(175): Deprecation: alias byKeyValue this is deprecated - Iterate over .byKeyValue instead.
/usr/lib/ldc/x86_64-linux-gnu/include/d/std/range/primitives.d(177): Deprecation: alias byKeyValue this is deprecated - Iterate over .byKeyValue instead.
/usr/lib/ldc/x86_64-linux-gnu/include/d/std/range/primitives.d(175): Deprecation: alias byKeyValue this is deprecated - Iterate over .byKeyValue instead.
/usr/lib/ldc/x86_64-linux-gnu/include/d/std/range/primitives.d(177): Deprecation: alias byKeyValue this is deprecated - Iterate over .byKeyValue instead.
../utils/vibe/utils/dictionarylist.d(77): Deprecation: alias byKeyValue this is deprecated - Iterate over .byKeyValue instead.
../utils/vibe/utils/dictionarylist.d(77): Deprecation: alias byKeyValue this is deprecated - Iterate over .byKeyValue instead.
ninja: build stopped: subcommand failed.
dh_auto_build: error: cd obj-x86_64-linux-gnu && LC_ALL=C.UTF-8 ninja -j32 -v returned exit code 1
make: *** [debian/rules:8: build] Error 25
dpkg-buildpackage: error: debian/rules build subprocess returned exit status 2

Summary

Multi-arch fixes.

Full build log Full worker log