build-failed

Package Suite Start Time Duration Description
ace lintian-fixes 2021-04-20T06:18 1m14s AssertionError:
ace multiarch-fixes 2021-04-21T11:22 1m26s AssertionError:
asterisk-core-sounds lintian-fixes 2021-04-20T06:58 1m35s UScan failed to run: Can't exec "svn-upgrade": No such file or directory at /usr/share/perl5/Dpkg/IPC.pm line 311..
bash cme 2021-04-20T07:42 2m42s Please add "debian/changelog" to the branch using bzr add.
bidict-upstream upstream-unchanged 2021-05-14T23:45 36s ['python3', './setup.py', 'build'] failed with unidentified error (return code 1)
boinctui lintian-fixes 2021-04-21T10:08 1m6s UScan failed to run: FAIL Checking OpenPGP signature (no keyring).
boinctui scrub-obsolete 2021-04-20T06:40 27s UScan failed to run: FAIL Checking OpenPGP signature (no keyring).
boost1.71 multiarch-fixes 2021-04-21T11:55 2m12s UScan failed to run: In directory ., downloading https://dl.bintray.com/boostorg/release/1.74.0/boost_1_74_0.tar.bz2 failed: 404 Not Found.
cider lintian-fixes 2021-04-20T05:14 2m44s AssertionError:
cvs lintian-fixes 2021-04-19T20:03 1m24s AssertionError:
dark-gtk-themes lintian-fixes 2021-04-20T07:10 39s UScan failed to run: In debian/watch no matching files for watch line https://github.com/infinity0/dark-themes/tags (?:.*?/)?v?(\d[\d.]*)\.tar\.gz debian uupdate.
dist lintian-fixes 2021-04-19T19:00 2m45s Not a branch: "https://svn.code.sf.net/p/dist/code/trunk/dist/".
dmarcts-report-parser lintian-fixes 2021-04-20T03:47 26s This operation is not supported by the Git smart server protocol.
doc-debian cme 2021-04-21T10:25 33s Please add "debian/changelog" to the branch using bzr add.
doc-rfc lintian-fixes 2021-04-22T07:34 5m48s tar: This does not look like a tar archive
dovecot lintian-fixes 2021-04-21T10:50 3m39s tar: This does not look like a tar archive
drascula multiarch-fixes 2021-04-21T11:30 1m50s AssertionError:
dssp-upstream upstream-unchanged 2021-05-14T22:57 51s configure: error: Could not find a version of the library!
dune-common fresh-snapshots 2021-04-24T05:19 48s brz: ERROR: [Errno 28] No space left on device
dwgsim-upstream upstream-unchanged 2021-05-15T17:14 14s make[1]: *** No rule to make target 'lib'. Stop.
esniper unchanged 2021-04-16T19:03 21s AssertionError:
fast-cpp-csv-parser lintian-fixes 2021-04-20T03:25 1m11s This operation is not supported by the Git smart server protocol.
fast-cpp-csv-parser multiarch-fixes 2021-04-21T11:32 43s This operation is not supported by the Git smart server protocol.
fast-cpp-csv-parser unchanged 2021-04-20T03:14 12s This operation is not supported by the Git smart server protocol.
firmware-free fresh-snapshots 2021-04-21T10:31 3m9s UScan failed to run: uscan warning: In debian/watch no matching refs for version 20210315+git20210419.1.8528618 in watch line https://git.kernel.org/pub/scm/linux/kernel/git/firmware/linux-firmware.git refs/tags/(.*) debian.
firmware-microbit-micropython lintian-fixes 2021-04-19T21:50 59s tar: This does not look like a tar archive
foobillardplus lintian-fixes 2021-04-20T06:49 49s None
foobillardplus multiarch-fixes 2021-04-21T11:34 1m19s None
fortunes-de lintian-fixes 2021-04-20T03:48 33s UScan failed to run: uscan error: Parameter /tmp/tmppck7j20t/container/FakeWatchNoUpstreamSiteForThisPackage-0.No-Site.gz does not look like a tar archive or a zip file..
gcc-9 lintian-fixes 2021-04-21T10:41 4m41s UScan failed to run: debian/watch is an obsolete version 2 watch file; please upgrade to a higher version (see uscan(1) for details)..
geronimo-validation-1.0-spec lintian-fixes 2021-05-15T14:13 2m53s UScan failed to run: uscan error: Parameter /tmp/tmpp_a_g4w2/container/geronimo-validation_1.0_spec-1.1 does not look like a tar archive or a zip file..
giflib fresh-snapshots 2021-04-24T10:33 1m41s AssertionError:
git-annex lintian-fixes 2021-04-27T09:30 3d7h ValueError: too many values to unpack (expected 10)
gitlab lintian-fixes 2021-04-22T06:41 6m44s tar: This does not look like a tar archive
gitlab-ci-multi-runner fresh-releases 2021-04-26T19:16 2m42s AssertionError:
gitlab-workhorse lintian-fixes 2021-04-21T11:09 42s tar: This does not look like a tar archive
glibc unchanged 2021-04-20T03:41 2m58s UScan failed to run: In debian/watch no matching files for version 2.31 in watch line ftp://ftp.gnu.org/gnu/glibc/glibc-([\d\.]+)\.tar\.gz debian uupdate.
glue-schema lintian-fixes 2021-04-20T06:48 10m1s Connection error: Couldn't resolve host 'svn.cern.ch' [Errno -2] Name or service not known
glue-schema multiarch-fixes 2021-04-21T11:35 5m10s Connection error: Couldn't resolve host 'svn.cern.ch' [Errno -2] Name or service not known
glw lintian-fixes 2021-05-13T02:00 4m13s UScan failed to run: In debian/watch no matching files for version 8.0.0 in watch line ftp://freedesktop.org/pub/mesa/glw/ glw-(.*)\.tar\.gz.
glw multiarch-fixes 2021-04-21T11:36 32s UScan failed to run: In debian/watch no matching files for version 8.0.0 in watch line ftp://freedesktop.org/pub/mesa/glw/ glw-(.*)\.tar\.gz.
gnat-gps lintian-fixes 2021-04-21T10:26 11m28s UScan failed to run: uscan error: Parameter /tmp/tmpsi25o7im/container/20.2 does not look like a tar archive or a zip file..
gnome-shell-extension-trash lintian-fixes 2021-04-20T07:11 43s AssertionError:
gnuit lintian-fixes 2021-04-20T05:51 9m16s UScan failed to run: In debian/watch no matching files for version 4.9.6 in watch line ftp://ftp.gnu.org/gnu/gnuit/gnuit-(.*)\.tar\.gz.
gnuit mia 2021-04-20T08:34 30s UScan failed to run: In debian/watch no matching files for version 4.9.6 in watch line ftp://ftp.gnu.org/gnu/gnuit/gnuit-(.*)\.tar\.gz.
gnuit unchanged 2021-04-20T04:27 39m8s UScan failed to run: In debian/watch no matching files for version 4.9.6 in watch line ftp://ftp.gnu.org/gnu/gnuit/gnuit-(.*)\.tar\.gz.
gnu-smalltalk lintian-fixes 2021-04-22T02:34 3m20s UScan failed to run: In debian/watch no matching files for version 3.2.5 in watch line ftp://ftp.gnu.org/gnu/smalltalk/smalltalk-(.*)\.tar\.gz debian uupdate.
gnu-smalltalk multiarch-fixes 2021-04-22T07:02 1m14s UScan failed to run: In debian/watch no matching files for version 3.2.5 in watch line ftp://ftp.gnu.org/gnu/smalltalk/smalltalk-(.*)\.tar\.gz debian uupdate.
golang-github-coreos-discovery-etcd-io lintian-fixes 2021-04-26T19:39 1m9s UScan failed to run: unrecognized option \\.
golang-github-shiena-ansicolor fresh-snapshots 2021-04-19T22:45 1m43s AssertionError:
google-auth-java-upstream upstream-unchanged 2021-05-14T22:53 3m6s ['mvn', 'compile'] failed with unidentified error (return code 1)
hdf-eos5 lintian-fixes 2021-04-21T10:54 5m31s UScan failed to run: In watch file debian/watch, reading FTP directory ftp://edhs1.gsfc.nasa.gov/edhs/hdfeos5/latest_release/ failed: 500 Network is unreachable.
hera lintian-fixes 2021-04-20T08:42 1m22s This operation is not supported by the Git smart server protocol.
highlight fresh-snapshots 2021-04-16T01:43 8m24s This operation is not supported by the Git smart server protocol.
httpunit multiarch-fixes 2021-04-21T11:40 42s AssertionError:
iaxmodem lintian-fixes 2021-04-20T03:40 1m53s AssertionError:
iaxmodem unchanged 2021-04-20T06:25 4m39s AssertionError:
ipv6calc fresh-snapshots 2021-04-16T05:27 4m6s UScan failed to run: In debian/watch no matching files for version 2.2.0+git20200124.8c7eea5 in watch line ftp://ftp.bieringer.de/pub/linux/IPv6/ipv6calc/ ipv6calc-(.+)\.tar\.gz.
jgromacs multiarch-fixes 2021-04-21T11:43 25s [Errno 20] Not a directory: '/tmp/janitor5gda1ayy/jgromacs/debian/upstream/metadata'
jgromacs unchanged 2021-04-20T03:13 8s [Errno 20] Not a directory: '/tmp/janitoreit8577e/jgromacs/debian/upstream/metadata'
jsrender fresh-snapshots 2021-04-24T10:11 4m48s No file to patchdpkg-source: error: LC_ALL=C patch -t -F 0 -N -p1 -u -V never -E -b -B .pc/00-fix_paths.patch/ --reject-file=- < jsrender-1.0.11.orig.MVp6HM/debian/patches/00-fix_paths.patch subprocess returned exit status 1
jsxgraph multiarch-fixes 2021-04-21T11:44 40s find: ‘+dfsg1’: No such file or directory
kalzium scrub-obsolete 2021-04-26T19:35 56s UScan failed to run: FAIL Checking OpenPGP signature (no signature file downloaded).
kdevelop multiarch-fixes 2021-04-26T18:22 1m3s UScan failed to run: In directory ., downloading https://download.kde.org/stable/kdevelop/5.6.2/src/kdevelop-5.6.2.tar.xz failed: 500 Can't connect to chernabog.cc.vt.edu:443 (Name or service not known).
khangman scrub-obsolete 2021-04-26T19:40 38s UScan failed to run: In directory ., downloading https://download.kde.org/stable/release-service/20.12.1/src/khangman-20.12.1.tar.xz failed: 500 Can't connect to chernabog.cc.vt.edu:443 (Name or service not known).
kodi lintian-fixes 2021-04-20T05:34 2m33s tar: This does not look like a tar archive
kodi-audiodecoder-fluidsynth-upstream upstream-unchanged 2021-05-14T22:51 4s make: *** No rule to make target 'all'. Stop.
kodi-audiodecoder-sidplay-upstream upstream-unchanged 2021-05-15T16:52 7s make: *** No rule to make target 'all'. Stop.
kompare multiarch-fixes 2021-04-22T02:14 1m19s UScan failed to run: FAIL Checking OpenPGP signature (no signature file downloaded).
konqueror scrub-obsolete 2021-04-22T09:28 1m4s UScan failed to run: In directory ., downloading https://download.kde.org/stable/release-service/20.12.0/src/konqueror-20.12.0.tar.xz failed: 500 Can't connect to chernabog.cc.vt.edu:443 (Name or service not known).
kpmcore multiarch-fixes 2021-04-26T18:25 38s UScan failed to run: In directory ., downloading https://download.kde.org/stable/release-service/20.12.3/src/kpmcore-20.12.3.tar.xz failed: 500 Can't connect to chernabog.cc.vt.edu:443 (Name or service not known).
kspaceduel scrub-obsolete 2021-05-15T18:07 32s UScan failed to run: FAIL Checking OpenPGP signature (no signature file downloaded).
ksystemlog unchanged 2021-04-12T07:13 19s UScan failed to run: In directory ., downloading https://download.kde.org/stable/release-service/20.12.0/src/ksystemlog-20.12.0.tar.xz failed: 500 Can't connect to mirror.math.princeton.edu:443 (Connection refused).
libajaxtags-java fresh-releases 2021-04-24T09:03 47s UScan failed to run: End-of-central-directory signature not found. Either this file is not.
libcatalyst-view-component-subinclude-perl-upstream debianize 2021-04-30T16:31 42m13s ValueError: too many values to unpack (expected 10)
libchart-clicker-perl-upstream upstream-unchanged 2021-05-14T22:33 6m27s ['/usr/bin/dzil', 'build'] failed with unidentified error (return code 255)
libfonts-java lintian-fixes 2021-04-20T06:17 1m44s UScan failed to run: tar: A lone zero block at 6569.
libfonts-java multiarch-fixes 2021-04-21T11:45 49s UScan failed to run: tar: A lone zero block at 6569.
libfonts-java scrub-obsolete 2021-04-20T04:08 50s UScan failed to run: tar: A lone zero block at 6569.
libfonts-java unchanged 2021-04-20T03:39 33s UScan failed to run: tar: A lone zero block at 6569.
libgit-repository-plugin-log-perl-upstream upstream-unchanged 2021-05-15T17:04 1m11s ['/usr/bin/dzil', 'build'] failed with unidentified error (return code 128)
libiscwt-java fresh-releases 2021-04-27T04:14 4m48s UScan failed to run: End-of-central-directory signature not found. Either this file is not.
libiscwt-java lintian-fixes 2021-04-20T06:59 2m29s UScan failed to run: End-of-central-directory signature not found. Either this file is not.
libisfreetype-java lintian-fixes 2021-05-14T19:05 7m30s UScan failed to run: End-of-central-directory signature not found. Either this file is not.
libisfreetype-java multiarch-fixes 2021-04-21T11:48 1m26s UScan failed to run: End-of-central-directory signature not found. Either this file is not.
libisrt-java lintian-fixes 2021-05-14T16:13 2m6s UScan failed to run: End-of-central-directory signature not found. Either this file is not.
libjmac-java lintian-fixes 2021-05-14T16:10 2m14s UScan failed to run: tar: A lone zero block at 6240.
libjorbis-java multiarch-fixes 2021-04-21T11:49 36s UScan failed to run: End-of-central-directory signature not found. Either this file is not.
libjspeex-java lintian-fixes 2021-05-14T07:39 2m39s UScan failed to run: mv: cannot stat 'jspeex': No such file or directory.
liblms7compact lintian-fixes 2021-04-20T05:41 51s AssertionError:
liblockfile lintian-fixes 2021-04-20T03:51 2m45s None
liblockfile scrub-obsolete 2021-04-20T04:09 21s None
libmath-int128-perl-upstream upstream-unchanged 2021-05-15T17:18 1m3s make: *** No rule to make target 'check'. Stop.
libneo4j-client lintian-fixes 2021-04-21T10:29 2m9s UScan failed to run: FAIL Checking OpenPGP signature (no signature file downloaded).
libneo4j-client multiarch-fixes 2021-04-21T11:50 41s UScan failed to run: FAIL Checking OpenPGP signature (no signature file downloaded).
libparams-coerce-perl-upstream upstream-unchanged 2021-05-14T21:55 6m48s ['/usr/bin/dzil', 'build'] failed with unidentified error (return code 128)
libpixie-java lintian-fixes 2021-04-20T05:47 2m59s UScan failed to run: mv: cannot stat '../pixie-0.8.8.tar.gz': No such file or directory.
libpixie-java unchanged 2021-04-20T04:25 21s UScan failed to run: mv: cannot stat '../pixie-0.8.8.tar.gz': No such file or directory.
libsvn-look-perl-upstream upstream-unchanged 2021-05-14T23:15 1m8s Execution of Makefile.PL aborted due to compilation errors.
libswarmcache-java lintian-fixes 2021-05-12T09:15 1m35s AssertionError:
libsystem-command-perl-upstream upstream-unchanged 2021-05-15T17:12 2m34s ['/usr/bin/dzil', 'build'] failed with unidentified error (return code 128)
libunicode-linebreak-perl fresh-snapshots 2021-04-21T10:39 1m58s E: Failed to run dpkg-source --before-build /tmp/janitormnh3d7is/build-area/libunicode-linebreak-perl-0.0.20190101+git20181229.43dab87
libxtrx lintian-fixes 2021-04-20T05:49 1m41s AssertionError:
marble multiarch-fixes 2021-04-14T15:37 1m23s UScan failed to run: In directory ., downloading https://download.kde.org/stable/release-service/20.12.3/src/marble-20.12.3.tar.xz failed: 500 Can't connect to chernabog.cc.vt.edu:443 (Network is unreachable).
meshlab-upstream debianize 2021-04-30T15:38 2h5m ValueError: too many values to unpack (expected 10)
mp3splt lintian-fixes 2021-04-21T10:09 2m27s None
nbformat-upstream debianize 2021-04-30T16:30 38m26s ValueError: too many values to unpack (expected 10)
nfft-upstream upstream-unchanged 2021-05-14T23:36 1m34s configure: error: You don't seem to have the FFTW 3 library installed. You can #
ngspice lintian-fixes 2021-04-21T10:48 1m50s tar: This does not look like a tar archive
node-boom scrub-obsolete 2021-05-14T23:09 37s tar: This does not look like a tar archive
node-hoek unchanged 2021-05-12T08:03 9s tar: This does not look like a tar archive
node-markdown-it lintian-fixes 2021-04-21T10:22 54s tar: This does not look like a tar archive
node-prosemirror-transform lintian-fixes 2021-04-20T01:09 59s tar: This does not look like a tar archive
node-srs unchanged 2021-05-14T22:29 16s tar: This does not look like a tar archive
nvidia-graphics-drivers-legacy-390xx lintian-fixes 2021-04-20T03:43 1m33s UScan failed to run: uscan error: Parameter /tmp/tmpplokmu89/container/NVIDIA-Linux-x86-390.141.run does not look like a tar archive or a zip file..
nvidia-graphics-drivers-tesla-450 lintian-fixes 2021-04-20T05:35 1m35s UScan failed to run: In directory ., downloading Version 450.102.04 failed: 400 URL must be absolute.
pci.ids fresh-snapshots 2021-04-21T10:44 1m2s AssertionError:
plasma-disks scrub-obsolete 2021-05-15T17:24 34s UScan failed to run: In directory ., downloading https://download.kde.org/stable/plasma/5.20.5/plasma-disks-5.20.5.tar.xz failed: 500 Can't connect to chernabog.cc.vt.edu:443 (Name or service not known).
plasma-framework unchanged 2021-04-21T12:19 1m5s UScan failed to run: FAIL Checking OpenPGP signature (no signature file downloaded).
puppet-module-rodjek-logrotate lintian-fixes 2021-04-20T06:51 1m1s AssertionError:
python-biplist-upstream upstream-unchanged 2021-03-24T13:22 9m37s (1, ['tox'], ['GLOB sdist-make: /build/tmpj596xkic/package/setup.py', 'py26 create: /build/tmpj596xkic/package/.tox/py26', 'ERROR: InterpreterNotFound: python2.6', 'py27 create: /build/tmpj596xkic/package/.tox/py27', 'ERROR: InterpreterNotFound: python2.7', 'py36 create: /build/tmpj596xkic/package/.tox/py36', 'ERROR: InterpreterNotFound: python3.6', '___________________________________ summary ____________________________________', 'ERROR: py26: InterpreterNotFound: python2.6', 'ERROR: py27: InterpreterNotFound: python2.7', 'ERROR: py36: InterpreterNotFound: python3.6'])
python-bitstring-upstream upstream-unchanged 2021-05-14T22:13 4m34s ['python3', './setup.py', 'test'] failed with unidentified error (return code 1)
python-coverage fresh-releases 2021-04-27T01:37 21s AssertionError:
python-dugong-upstream upstream-unchanged 2021-05-14T23:48 26s Setuptools/distribute package not found. Please install from https://pypi.python.org/pypi/distribute
python-jsonext lintian-fixes 2021-04-22T13:58 14s debian.changelog.ChangelogParseError: Could not parse changelog: Unexpected line while looking for more change data or trailer: -- Thu, 22 Apr 2021 14:58:40 -0000
python-openstackdocstheme lintian-fixes 2021-04-20T07:22 2m23s UScan failed to run: malformed opts=... in watch file, skipping line:
python-proliantutils multiarch-fixes 2021-04-21T11:58 48s UScan failed to run: uscan warning: In debian/watch no matching refs for version 2.11.0 in watch line https://opendev.org/x/proliantutils refs/tags/v([\d\.]+) debian uupdate.
python-pure-sasl lintian-fixes 2021-04-20T07:19 1m42s AssertionError:
python-rjsmin lintian-fixes 2021-04-20T07:13 1m10s UScan failed to run: malformed opts=... in watch file, skipping line:
python-xstatic multiarch-fixes 2021-04-21T11:59 29s Not a branch: "https://bitbucket.org/thomaswaldmann/xstatic/".
python-xstatic-angular-fileupload scrub-obsolete 2021-04-20T07:00 35s AssertionError:
qpid-proton lintian-fixes 2021-04-21T10:28 3m2s None
qpid-proton multiarch-fixes 2021-04-21T12:01 1m34s None
qtpim-opensource-src fresh-snapshots 2021-04-20T06:38 1m23s This operation is not supported by the Git smart server protocol.
r-cran-tinytest-upstream debianize 2021-04-30T16:53 18m54s ValueError: too many values to unpack (expected 10)
rednotebook lintian-fixes 2021-04-20T06:43 1m32s AssertionError:
renderdoc lintian-fixes 2021-04-22T08:11 4m8s UScan failed to run: FAIL Checking OpenPGP signature (no signature file downloaded).
robocut unchanged 2021-04-22T03:16 9s UScan failed to run: Tag pattern missing version delimiters () in debian/watch, skipping: https://launchpad.net/robocut/ \ .
rtl-sdr fresh-snapshots 2021-04-27T03:09 6s UScan failed to run: uscan warning: In debian/watch no matching refs for version 0.6.0+git20201101.1.0847e93 in watch line git://git.osmocom.org/rtl-sdr.git refs/tags/([\d\.]+) debian uupdate.
ruby-raemon lintian-fixes 2021-04-20T07:16 1m2s UScan failed to run: redirecting DEPRECATED pkg-ruby-extras.alioth.debian.org/cgi-bin/gemwatch to gemwatch.debian.net.
ruby-raemon multiarch-fixes 2021-04-21T12:03 38s UScan failed to run: redirecting DEPRECATED pkg-ruby-extras.alioth.debian.org/cgi-bin/gemwatch to gemwatch.debian.net.
ruby-rethtool unchanged 2021-04-20T07:15 12s UScan failed to run: redirecting DEPRECATED pkg-ruby-extras.alioth.debian.org/cgi-bin/gemwatch to gemwatch.debian.net.
rust-addr2line fresh-releases 2021-04-21T10:27 5m6s Patch update-smallvec.patch does not apply (enforce with -f)
rust-ascii fresh-releases 2021-04-20T02:22 3m32s Patch remove-quickcheck-feature.diff does not apply (enforce with -f)
rust-ascii fresh-snapshots 2021-04-19T23:46 1m24s Patch remove-quickcheck-feature.diff does not apply (enforce with -f)
rust-backtrace fresh-releases 2021-04-21T10:34 2m15s Patch relax-dep.diff does not apply (enforce with -f)
rust-blake2-rfc lintian-fixes 2021-04-20T02:01 2m46s Patch fix-deps.diff does not apply (enforce with -f)
rust-cargo-lichking fresh-releases 2021-04-20T02:12 1m5s Patch relax-dep-versions.patch does not apply (enforce with -f)
rust-cargo-lock fresh-releases 2021-04-20T02:45 1m5s Patch fix-test-file-path.diff does not apply (enforce with -f)
rust-compiler-builtins fresh-releases 2021-04-21T10:36 3m26s Patch use-llvm_asm.patch does not apply (enforce with -f)
rust-cookie fresh-releases 2021-04-21T10:24 1m29s Patch upgrade-to-url-2.patch does not apply (enforce with -f)
rust-cpp-demangle fresh-releases 2021-04-20T08:55 1m23s Patch no-fuzzing.patch does not apply (enforce with -f)
rust-ctrlc fresh-releases 2021-04-13T02:31 1m14s Patch relax-dep.diff does not apply (enforce with -f)
rust-diesel-derives fresh-releases 2021-04-20T09:00 2m30s Patch relax-deps.patch does not apply (enforce with -f)
rust-diesel-derives fresh-snapshots 2021-04-20T08:11 1m58s Patch relax-deps.patch does not apply (enforce with -f)
rust-enum-primitive-derive fresh-releases 2021-04-20T02:32 7m27s Patch relax-deps.patch does not apply (enforce with -f)
rust-env-logger fresh-releases 2021-04-20T02:43 1m12s Patch relax-deps.diff does not apply (enforce with -f)
rust-errno fresh-releases 2021-04-20T02:29 5m29s Patch no-dragonfly.patch does not apply (enforce with -f)
rust-findshlibs fresh-releases 2021-04-20T02:13 4m2s Patch no-nightly.patch does not apply (enforce with -f)
rust-fst fresh-releases 2021-04-20T02:25 4m35s Patch relax-dep-versions.patch does not apply (enforce with -f)
rust-futures-channel fresh-releases 2021-04-20T02:30 9m21s Patch collapse-features.patch does not apply (enforce with -f)
rust-getrandom fresh-releases 2021-04-20T02:25 6m41s Patch drop-wasi.patch does not apply (enforce with -f)
rust-gimli fresh-releases 2021-04-20T02:21 1m12s Patch relax-dep.diff does not apply (enforce with -f)
rust-gimli fresh-snapshots 2021-04-19T23:53 1m58s Patch relax-dep.diff does not apply (enforce with -f)
rust-grcov fresh-releases 2021-04-20T02:26 1m19s Patch fix-deps.diff does not apply (enforce with -f)
rust-hdrhistogram fresh-releases 2021-04-20T02:18 3m21s Patch relax-deps.patch does not apply (enforce with -f)
rust-hdrhistogram fresh-snapshots 2021-04-19T23:49 1m21s Patch relax-deps.patch does not apply (enforce with -f)
rust-http fresh-releases 2021-04-21T10:20 2m4s Patch fix-capacity-overflows-in-headermap-reserve.patch does not apply (enforce with -f)
rust-lalrpop fresh-releases 2021-04-21T10:21 1m17s Patch unicode-xid-bump-0.2.patch does not apply (enforce with -f)
rust-locale-config fresh-releases 2021-04-20T02:34 1m4s Patch relax-dep.diff does not apply (enforce with -f)
rust-nom fresh-releases 2021-04-20T02:29 2m41s Patch relax-deps.patch does not apply (enforce with -f)
rust-nom-3 fresh-releases 2021-04-27T05:51 43s Patch memchr2.patch does not apply (enforce with -f)
rust-object fresh-releases 2021-04-21T10:25 1m16s Patch relax-deps.diff does not apply (enforce with -f)
rust-once-cell fresh-releases 2021-04-20T02:46 1m5s Patch update-parking-lot.patch does not apply (enforce with -f)
rust-onig fresh-releases 2021-04-20T02:44 4m9s Patch fix-dep.diff does not apply (enforce with -f)
rust-pbr fresh-releases 2021-04-20T02:07 1m17s Patch patch-out-windows.patch does not apply (enforce with -f)
rust-pem fresh-releases 2021-04-20T02:26 3m27s Patch relax-base64.diff does not apply (enforce with -f)
rust-pem fresh-snapshots 2021-04-19T23:58 1m21s Patch relax-base64.diff does not apply (enforce with -f)
rust-pin-project fresh-snapshots 2021-04-19T23:53 1m51s Patch readd-dev-deps.diff does not apply (enforce with -f)
rust-pin-project-internal fresh-releases 2021-04-20T02:18 5m7s Patch readd-dev-deps.diff does not apply (enforce with -f)
rust-pkg-config fresh-releases 2021-04-21T10:35 1m16s Patch no-special-snowflake-env.patch does not apply (enforce with -f)
rust-proptest fresh-releases 2021-04-20T02:22 1m8s Patch relax-deps.patch does not apply (enforce with -f)
rust-rayon fresh-releases 2021-04-20T02:23 1m9s Patch relax-dep-versions.patch does not apply (enforce with -f)
rust-regex-automata fresh-releases 2021-04-20T02:42 1m43s Patch ignore-std-tests.patch does not apply (enforce with -f)
rust-rfc822-sanitizer fresh-releases 2021-04-20T02:41 2m43s Patch relax-deps.diff does not apply (enforce with -f)
rust-roxmltree fresh-releases 2021-04-20T02:31 1m6s Patch xmlparser-11.patch does not apply (enforce with -f)
rust-rusty-tags fresh-releases 2021-04-20T02:38 1m4s Patch relax-dep-versions.patch does not apply (enforce with -f)
rust-sloppy-rfc4880 fresh-releases 2021-04-20T02:42 1m30s Patch update-deps.patch does not apply (enforce with -f)
rust-spotify-tui fresh-releases 2021-04-21T10:30 4m8s Patch bump-dirs.diff does not apply (enforce with -f)
rust-syn fresh-releases 2021-04-21T10:28 5m49s Patch relax-deps.patch does not apply (enforce with -f)
rust-syntect fresh-releases 2021-04-20T02:19 6m11s Patch bump-dep-onig-plist.diff does not apply (enforce with -f)
rust-syslog fresh-releases 2021-04-20T02:28 1m9s Patch bump-error-chain.patch does not apply (enforce with -f)
rust-system-deps fresh-releases 2021-04-20T02:36 1m5s Patch relax-deps.patch does not apply (enforce with -f)
rust-term fresh-releases 2021-04-20T02:35 1m6s Patch patch-deps.patch does not apply (enforce with -f)
rust-term fresh-snapshots 2021-04-19T23:56 1m56s Patch patch-deps.patch does not apply (enforce with -f)
rust-unicode-bidi lintian-fixes 2021-04-20T01:28 1m54s Patch no-flamegraphs.patch does not apply (enforce with -f)
rust-xmlparser fresh-releases 2021-04-21T10:32 1m51s Patch xmlparser-11.patch does not apply (enforce with -f)
rust-xmlparser lintian-fixes 2021-04-20T02:04 1m25s Patch xmlparser-11.patch does not apply (enforce with -f)
saclib lintian-fixes 2021-04-20T06:44 48s Please add "debian/changelog" to the branch using bzr add.
sbuild lintian-fixes 2021-04-21T10:57 16m58s build failed
sdo-api-java lintian-fixes 2021-05-14T15:14 3m1s UScan failed to run: uscan error: Parameter /tmp/tmpgl0cqo3x/container/1.1.1 does not look like a tar archive or a zip file..
signon-kwallet-extension unchanged 2021-04-20T07:04 18s UScan failed to run: In debian/watch, no matching hrefs for pattern https://download.kde.org/stable/applications/([\d.]+)/?.
singularity-container fresh-releases 2021-04-24T08:11 1m46s AssertionError:
snpomatic-upstream upstream-unchanged 2021-05-14T22:49 3s make: *** No rule to make target 'all'. Stop.
so-synth-lv2-upstream upstream-unchanged 2021-05-14T23:12 4s make: *** No rule to make target 'all'. Stop.
sphinxbase lintian-fixes 2021-04-20T06:16 53s AssertionError:
swing-layout multiarch-fixes 2021-04-22T09:25 27s Not a branch: "https://janitor.debian.net/git/swing-layout/": location is a repository.
switchconf lintian-fixes 2021-04-20T05:36 1m28s UScan failed to run: FAIL Checking OpenPGP signature (no keyring).
switchconf scrub-obsolete 2021-04-20T08:37 8s UScan failed to run: FAIL Checking OpenPGP signature (no keyring).
tinymux lintian-fixes 2021-04-22T02:40 2m53s UScan failed to run: In watch file debian/watch, reading webpage ftp://ftp.tinymux.org/tinymux-2.10/ failed: 404 File 'tinymux-2.10' not found.
tuxpaint fresh-snapshots 2021-04-27T03:05 1m0s UScan failed to run: debian/watch is an obsolete version 2 watch file; please upgrade to a higher version (see uscan(1) for details)..
tuxpaint-stamps multiarch-fixes 2021-04-21T12:08 27s UScan failed to run: debian/watch is an obsolete version 2 watch file; please upgrade to a higher version (see uscan(1) for details)..
tzdata lintian-fixes 2021-04-20T07:14 1m5s UScan failed to run: In watch file debian/watch, reading FTP directory ftp://ftp.iana.org/tz/releases/ failed: 404 File 'releases' not found.
ukui-notification-daemon lintian-fixes 2021-04-19T22:43 1m26s AssertionError:
websockify lintian-fixes 2021-04-19T23:51 1m51s AssertionError:
wpa unchanged 2021-04-19T23:41 1m9s AssertionError:
wxmaxima lintian-fixes 2021-04-20T02:58 5m24s UScan failed to run: stop mangling: rule="auto" rule doesn't match "(s|tr|y)/.*/.*/[a-z]*" (or similar)..
wxmaxima unchanged 2021-04-20T02:55 4m45s UScan failed to run: stop mangling: rule="auto" rule doesn't match "(s|tr|y)/.*/.*/[a-z]*" (or similar)..
x2goclient fresh-snapshots 2021-04-24T08:23 1m15s Cannot call rmtree on a symbolic link
xapian-core cme 2021-04-20T01:51 18s Please add "debian/changelog" to the branch using bzr add.
xdg-desktop-portal-kde unchanged 2021-04-19T10:48 44s UScan failed to run: In directory ., downloading https://download.kde.org/stable/plasma/5.20.5/xdg-desktop-portal-kde-5.20.5.tar.xz failed: 500 Can't connect to chernabog.cc.vt.edu:443 (Network is unreachable).
xkcdpass fresh-snapshots 2021-04-20T02:59 39s debian.changelog.ChangelogParseError: Could not parse changelog: Unexpected line while looking for more change data or trailer: -- Tue, 20 Apr 2021 02:59:27 -0000
xserver-xorg-video-qxl unchanged 2021-05-12T13:05 7m35s Not a branch: "https://janitor.debian.net/git/xserver-xorg-video-qxl/": location is a repository.
yade-upstream debianize 2021-05-04T14:00 10m50s Please add "debian/changelog" to the branch using bzr add.
yagf lintian-fixes 2021-04-19T23:48 1m9s UScan failed to run: unrecognized option http://sf.net/yagf-ocr/yagf-(.+)\.tar\.gz.
zxcvbn-c scrub-obsolete 2021-04-20T00:00 1m13s AssertionError: