dist-command-failed

Creating a dist tarball from an upstream source repository snapshot failed.

Package Suite Start Time Duration Description
accountsservice fresh-snapshots 2021-04-24T06:58 20m13s Dist command failed to produce a tarball: src/libaccountsservice/meson.build:94:10: ERROR: Program 'vapigen' not found
alsa-utils fresh-snapshots 2021-04-24T05:39 20m32s Dist command failed to produce a tarball: configure: error: Sufficiently new version of libasound not found.
alt-ergo fresh-snapshots 2021-04-24T09:11 5m38s Dist command failed to produce a tarball: Makefile:36: Makefile.config: No such file or directory
andi fresh-snapshots 2021-04-24T09:58 1m1s Dist command failed to produce a tarball: make[2]: *** [Makefile:1251: ChangeLog] Error 1
annexremote-upstream debianize 2021-04-22T06:28 2m33s Traceback (most recent call last):
apertium-eo-es-upstream debianize 2021-03-30T14:46 1h10m Dist command failed to produce a tarball: make[2]: *** No rule to make target '(BASENAME).es-eo.antaux3_t2x', needed by 'distdir-am'. Stop.
apertium-eo-fr-upstream debianize 2021-03-25T10:26 7m28s Dist command failed: Dist command failed to produce a tarball: make[2]: *** No rule to make target 'apertium-eo-fr.post-eo.dix', needed by 'distdir-am'. Stop.
apertium-hbs-mkd fresh-snapshots 2021-04-16T19:19 4m6s Dist command failed to produce a tarball: make[2]: *** No rule to make target 'apertium-hbs-mkd.mkd.tsx', needed by 'distdir-am'. Stop.
apertium-hbs-mkd-upstream debianize 2021-03-23T20:17 5m44s Dist command failed: Dist command failed to produce a tarball: make[2]: *** No rule to make target 'apertium-hbs-mkd.mkd.tsx', needed by 'distdir-am'. Stop.
apertium-lex-tools fresh-snapshots 2021-04-16T17:23 53s Dist command failed to produce a tarball: make[3]: *** No rule to make target 'distdir'. Stop.
apertium-lex-tools-upstream debianize 2021-03-30T15:23 10m27s Dist command failed to produce a tarball: make[3]: *** No rule to make target 'distdir'. Stop.
apertium-upstream debianize 2021-05-15T00:54 20h7m Dist command failed to produce a tarball: ['autoconf', '-f'] failed with unidentified error (return code 1)
aplpy-upstream debianize 2021-03-25T08:14 10m40s subprocess.CalledProcessError: Command '['/usr/bin/python', '-m', 'pip', '--disable-pip-version-check', 'wheel', '--no-deps', '-w', '/tmp/tmpm2l3kcgv', '--quiet', 'setuptools_scm']' returned non-zero exit status 1.
appstream-glib fresh-snapshots 2021-03-26T17:10 1h31m Dist command failed to produce a tarball: ninja: build stopped: subcommand failed.
argon2 fresh-snapshots 2021-03-26T20:35 45m46s Dist command failed to produce a tarball: make: *** [Makefile:215: dist] Error 2
arpack-upstream debianize 2021-03-25T07:36 4m54s Dist command failed: Dist command failed to produce a tarball: configure: error: in `/build/tmpx8lfs90u/arpack-upstream':
aspell fresh-snapshots 2021-04-24T10:05 2m16s Dist command failed to produce a tarball: make[2]: *** No rule to make target 'scripts/preunzip', needed by 'distdir-am'. Stop.
aspell-ar-large fresh-snapshots 2021-04-24T08:10 2m53s Dist command failed to produce a tarball: make[2]: *** No rule to make target 'scripts/preunzip', needed by 'distdir-am'. Stop.
aspell-bn fresh-snapshots 2021-03-29T17:36 4m48s Dist command failed to produce a tarball: make[2]: *** No rule to make target 'scripts/preunzip', needed by 'distdir-am'. Stop.
aspell-br fresh-snapshots 2021-03-29T18:26 2m28s Dist command failed to produce a tarball: make[2]: *** No rule to make target 'scripts/preunzip', needed by 'distdir-am'. Stop.
aspell-fa fresh-snapshots 2021-03-29T18:38 2m12s Dist command failed to produce a tarball: make[2]: *** No rule to make target 'scripts/preunzip', needed by 'distdir-am'. Stop.
aspell-he fresh-snapshots 2021-03-29T18:31 2m33s Dist command failed to produce a tarball: make[2]: *** No rule to make target 'scripts/preunzip', needed by 'distdir-am'. Stop.
aspell-hi fresh-snapshots 2021-03-29T18:40 2m0s Dist command failed to produce a tarball: make[2]: *** No rule to make target 'scripts/preunzip', needed by 'distdir-am'. Stop.
aspell-mr fresh-snapshots 2021-03-29T18:33 2m5s Dist command failed to produce a tarball: make[2]: *** No rule to make target 'scripts/preunzip', needed by 'distdir-am'. Stop.
aspell-or fresh-snapshots 2021-03-29T14:58 6m3s Dist command failed to produce a tarball: make[2]: *** No rule to make target 'scripts/preunzip', needed by 'distdir-am'. Stop.
aspell-pa fresh-snapshots 2021-03-29T17:31 4m39s Dist command failed to produce a tarball: make[2]: *** No rule to make target 'scripts/preunzip', needed by 'distdir-am'. Stop.
aspell-ta fresh-snapshots 2021-03-29T18:48 14m24s Dist command failed to produce a tarball: make[2]: *** No rule to make target 'scripts/preunzip', needed by 'distdir-am'. Stop.
aspell-te fresh-snapshots 2021-03-29T17:26 3m46s Dist command failed to produce a tarball: make[2]: *** No rule to make target 'scripts/preunzip', needed by 'distdir-am'. Stop.
astropy-upstream debianize 2021-03-25T06:40 1h40m subprocess.CalledProcessError: Command '['/usr/bin/python', '-m', 'pip', '--disable-pip-version-check', 'wheel', '--no-deps', '-w', '/tmp/tmp3kr3vwo9', '--quiet', 'setuptools_scm']' returned non-zero exit status 1.
astroquery-upstream debianize 2021-04-23T21:37 6m0s Dist command failed to produce a tarball: AttributeError: 'str' object has no attribute 'decode'
astroscrappy-upstream debianize 2021-03-25T06:31 18m20s AssertionError: Can't parse version upstream/1.0.8+git20210226.631ae4d
atanks fresh-snapshots 2021-04-24T01:16 4m4s Dist command failed to produce a tarball: tar: atanks/BUGS: Cannot stat: No such file or directory
at-spi2-atk-upstream debianize 2021-04-23T03:28 3m38s Dist command failed to produce a tarball: ninja: build stopped: subcommand failed.
at-spi2-core fresh-snapshots 2021-03-29T18:00 6m52s Dist command failed to produce a tarball: ninja: build stopped: subcommand failed.
at-spi2-core-upstream debianize 2021-04-23T03:28 2m40s Dist command failed to produce a tarball: ninja: build stopped: subcommand failed.
auctex fresh-snapshots 2021-04-24T04:27 18m32s Dist command failed to produce a tarball: make: *** [Makefile:500: check-tag] Error 1
automake1.11 fresh-snapshots 2021-04-24T06:45 6m58s Dist command failed to produce a tarball: ['make', 'dist'] failed with unidentified error (return code 2)
avldrums.lv2-upstream debianize 2021-04-22T19:57 2m3s Dist command failed to produce a tarball: ['make', 'dist'] failed with unidentified error (return code 2)
avogadrolibs-upstream debianize 2021-03-25T06:06 25m9s AssertionError: Can't parse version upstream/1.93.1+git20210317.9123e38
azure-cosmos-table-python-upstream debianize 2021-04-23T03:29 1m37s FileNotFoundError: [Errno 2] No such file or directory: 'setup.py'
azure-kusto-python-upstream debianize 2021-04-22T20:51 1m12s Dist command failed to produce a tarball: ValueError: Setup file is written to support travis publish.
azure-uamqp-python-upstream debianize 2021-04-22T20:51 59s Dist command failed to produce a tarball: ValueError: You need to install cython==0.29.21 in order to execute this setup.py if 'uamqp/c_uamqp.c' does not exists
bali-phy-upstream debianize 2021-04-22T14:51 27m14s Dist command failed to produce a tarball: ninja: build stopped: subcommand failed.
bandage fresh-snapshots 2021-04-16T17:35 1m25s Dist command failed to produce a tarball: ['qmake'] failed with unidentified error (return code 1)
barclay-upstream debianize 2021-04-22T14:49 2m21s Dist command failed to produce a tarball: ['./gradlew', 'distTar'] failed with unidentified error (return code 1)
bcftools-upstream debianize 2021-04-24T20:35 33s Dist command failed to produce a tarball: config.mk:34: ../htslib/htslib_static.mk: No such file or directory
berusky2 fresh-snapshots 2021-04-16T18:49 2m9s Dist command failed to produce a tarball: **Error**: Directory `.' does not look like the top-level package directory
berusky2-upstream debianize 2021-03-23T18:23 39s Dist command failed: Dist command failed to produce a tarball: **Error**: Directory `.' does not look like the top-level package directory
bibtool fresh-snapshots 2021-04-24T04:05 3m5s Dist command failed to produce a tarball: Makefile:29: makefile: No such file or directory
biomaj3-core-upstream debianize 2021-04-22T20:48 2m4s NameError: name 'find_packages' is not defined
biomaj3-daemon-upstream debianize 2021-04-22T14:20 2m14s NameError: name 'find_packages' is not defined
biomaj3-upstream debianize 2021-03-25T16:48 6m39s NameError: name 'find_packages' is not defined
bioperl-run fresh-snapshots 2021-04-24T18:02 2d4h Dist command failed to produce a tarball: ['apt', '-y', 'satisfy', 'debhelper-compat (= 13)', 'perl,\n libmodule-build-perl,\n bioperl (>= 1.7.4),\n libalgorithm-diff-perl,\n libipc-run-perl,\n libio-string-perl,\n libxml-twig-perl,\n libfile-sort-perl,\n libtest-most-perl,\n libarray-compare-perl,\n libtree-dagnode-perl,\n libbio-cluster-perl,\n libbio-featureio-perl,\n libconfig-any-perl,\n libbio-tools-run-alignment-clustalw-perl,\n libbio-eutilities-perl,\n libbio-tools-run-remoteblast-perl,\n amap-align,\n bedtools,\n bedtools-test,\n ncbi-blast+-legacy,\n clustalw,\n emboss,\n exonerate,\n hmmer [any-amd64 any-i386 powerpc ppc64],\n hyphy-pt | hyphy-mpi,\n infernal [any-amd64 any-i386],\n kalign,\n mafft,\n muscle,\n ncoils,\n phyml,\n primer3,\n probcons,\n python3-pybedtools,\n raxml,\n samtools,\n sim4,\n tigr-glimmer,\n wise,\n fasttree,\n lagan,\n pal2nal,\n pftools [any-amd64],\n libwww-perl'] failed with unidentified error (return code 1)
bio-tradis-upstream debianize 2021-04-22T14:49 13m29s Dist command failed to produce a tarball: ['/usr/bin/dzil', 'build', '--tgz'] failed with unidentified error (return code 255)
blackbox fresh-snapshots 2021-04-27T00:17 1m6s Dist command failed to produce a tarball: Makefile:604: *** missing separator. Stop.
blasr fresh-snapshots 2021-04-27T00:16 49s Dist command failed to produce a tarball: ctest/meson.build:1:0: ERROR: Program 'cram' not found
bluebird-gtk-theme fresh-snapshots 2021-04-16T16:28 57s Dist command failed to produce a tarball: cp: cannot stat './compile': No such file or directory
boinc fresh-snapshots 2021-03-26T16:49 1h25m Dist command failed to produce a tarball: make[4]: *** No rule to make target 'acx_pthread.m4', needed by 'distdir-am'. Stop.
caffe fresh-snapshots 2021-04-16T15:31 8m27s Dist command failed to produce a tarball: Makefile:6: *** Makefile.config not found. See Makefile.config.example.. Stop.
calf-upstream debianize 2021-04-22T14:20 1m32s Dist command failed to produce a tarball: libtoolize not found
camlidl fresh-snapshots 2021-04-24T07:15 5m19s Dist command failed to produce a tarball: Makefile:15: config/Makefile: No such file or directory
can-utils fresh-snapshots 2021-04-27T00:38 34s Dist command failed to produce a tarball: make: *** No rule to make target 'dist'.
cbor2-upstream debianize 2021-03-23T19:24 14m38s AssertionError: Can't parse version upstream/5.2.0+git20210322.be01e2d
cellwriter fresh-snapshots 2021-03-29T17:30 1m14s Dist command failed to produce a tarball: Makefile:408: .deps/wordfreq.Po: No such file or directory
ceres-solver-upstream debianize 2021-03-23T20:04 3m9s Dist command failed: Dist command failed to produce a tarball: Error: No files in <filelist> section of package.xml
changeo-upstream debianize 2021-04-23T00:03 2m5s RuntimeError: 'distutils.core.setup()' was never called -- perhaps 'setup.py' is not a Distutils setup script?
cif-tools-upstream debianize 2021-04-24T20:57 1m26s Dist command failed to produce a tarball: configure: error: Could not find a version of the library!
cinnamon-control-center fresh-snapshots 2021-04-16T18:02 2m46s Dist command failed to produce a tarball: ninja: build stopped: subcommand failed.
clp-upstream debianize 2021-04-23T03:32 2m24s Dist command failed to produce a tarball: configure: error: Required package CoinUtils not available.
cme-upstream debianize 2021-04-09T18:42 1m7s Dist command failed to produce a tarball: ['/usr/bin/dzil', 'build', '--tgz'] failed with unidentified error (return code 2)
cmus fresh-snapshots 2021-04-24T08:25 6m27s Dist command failed to produce a tarball: make: *** [Makefile:296: dist] Error 1
cmus-upstream debianize 2021-03-23T19:55 24s Dist command failed: Dist command failed to produce a tarball: make: *** [Makefile:296: dist] Error 1
coinor-osi-upstream debianize 2021-04-23T03:34 2m2s Dist command failed to produce a tarball: configure: error: Required package CoinUtils not available.
compiz-boxmenu fresh-snapshots 2021-04-04T16:22 41s Dist command failed to produce a tarball: Makefile:16: *** Python not found. Version >= 2.7 or 2.6 is required.. Stop.
conda-package-handling-upstream debianize 2021-04-14T17:27 5m14s AttributeError: module 'versioneer' has no attribute 'get_version'
consensuscore fresh-snapshots 2021-04-24T06:10 3m58s Dist command failed to produce a tarball: src/SWIG/meson.build:2:0: ERROR: python2.7 not found
cov-core-upstream debianize 2021-04-22T22:30 1m54s IndexError: list index out of range
cpanoutdated-upstream debianize 2021-04-24T20:32 40s Dist command failed to produce a tarball: ['minil', 'dist'] failed with unidentified error (return code 0)
csound-manual-upstream debianize 2021-03-23T19:58 4m53s Dist command failed: Dist command failed to produce a tarball: make[1]: *** [Makefile:693: xsl/customXHTMLchunk.xsl] Error 1
csoundqt fresh-snapshots 2021-04-24T02:35 19m8s Dist command failed to produce a tarball: ['qmake'] failed with unidentified error (return code 1)
cufflinks fresh-snapshots 2021-04-24T04:08 3m1s Dist command failed to produce a tarball: checking for htslib or bamlib... configure: error: We could not detect the bam libraries. Try installing htslib or libbam, or specifying a path to one with --with-bam=/some/path
cups fresh-snapshots 2021-04-24T06:49 4m51s Dist command failed to produce a tarball: Makefile:12: Makedefs: No such file or directory
curl fresh-snapshots 2021-04-27T00:18 9m17s Dist command failed to produce a tarball: configure: error: select TLS backend(s) or disable TLS with --without-ssl.
cwidget fresh-snapshots 2021-03-27T00:41 38m38s Dist command failed to produce a tarball: make[6]: *** No rule to make target 'README.layout', needed by 'distdir-am'. Stop.
cwlformat-upstream debianize 2021-04-22T22:25 1m58s FileNotFoundError: [Errno 2] No such file or directory: 'Readme.md'
cwltool fresh-snapshots 2021-04-24T04:54 10m2s Dist command failed to produce a tarball: error: [Errno 2] No such file or directory: 'git'
cwltool-upstream debianize 2021-03-23T22:16 4m13s Dist command failed: Dist command failed to produce a tarball: error: [Errno 2] No such file or directory: 'git'
cyphesis-cpp-upstream debianize 2021-04-22T20:37 3m57s Dist command failed to produce a tarball: configure: error:
cyrus-imapd fresh-snapshots 2021-04-30T19:05 31m1s Dist command failed to produce a tarball: make[2]: *** [Makefile:8552: doc/html/.sphinx-build.stamp] Error 1
cyrus-sasl2 fresh-snapshots 2021-04-20T05:24 2m35s Dist command failed to produce a tarball: Could not import extension sphinxlocal.builders.manpage (exception: cannot import name 'NoUri' from 'sphinx.environment' (/usr/lib/python3/dist-packages/sphinx/environment/__init__.py))
dateutils fresh-snapshots 2021-04-16T19:25 1m51s Dist command failed to produce a tarball: make: *** [GNUmakefile:33: abort-due-to-no-makefile] Error 1
dav1d-upstream debianize 2021-04-22T20:32 1m39s Dist command failed to produce a tarball: meson.build:388:4: ERROR: Program 'nasm' not found
density-fitness-upstream debianize 2021-04-22T20:22 46s Dist command failed to produce a tarball: configure: error: Could not find a version of the library!
devpi-common-upstream debianize 2021-04-22T20:20 1m33s FileNotFoundError: [Errno 2] No such file or directory: 'setup.py'
d-feet fresh-snapshots 2021-04-16T15:41 2m3s Dist command failed to produce a tarball: (tests.py:270897): Gtk-CRITICAL **: 15:43:06.639: _gtk_style_provider_private_get_settings: assertion 'GTK_IS_STYLE_PROVIDER_PRIVATE (provider)' failed
dino-im fresh-snapshots 2021-04-09T17:23 2m32s Dist command failed to produce a tarball: ninja: error: unknown target 'dist', did you mean 'dino'?
dipy-upstream debianize 2021-04-22T20:18 2m3s Dist command failed to produce a tarball: RuntimeError: We need package Cython, but not importable
discodos-upstream debianize 2021-04-22T20:32 3m28s Dist command failed to produce a tarball: Exception: Versioning for this project requires either an sdist tarball, or access to an upstream git repository. It's also possible that there is a mismatch between the package name in setup.cfg and the argument given to pbr.version.VersionInfo. Project name discodos was given, but was not able to be found.
django-auth-ldap fresh-snapshots 2021-04-16T19:24 2d13h Dist command failed to produce a tarball: ['apt', '-y', 'satisfy', 'debhelper-compat (= 13),\n dh-python,\n ldap-utils,\n python3-all,\n python3-django,\n python3-doc,\n python3-mock,\n python3-mockldap (>= 0.2.7~),\n python3-pyldap,\n python3-setuptools,\n python3-sphinx,\n slapd'] failed with unidentified error (return code 1)
django-js-reverse-upstream debianize 2021-04-22T14:59 3m59s FileNotFoundError: [Errno 2] No such file or directory: 'CHANGELOG.rst'
dssp-upstream debianize 2021-04-22T14:41 6s Dist command failed to produce a tarball: configure: error: mrc not found, the application will be built without resources
dvdauthor fresh-releases 2021-04-04T17:02 1m48s Dist command failed to produce a tarball: configure.ac:136: error: required file 'autotools/config.rpath' not found
dvtm fresh-snapshots 2021-04-16T15:06 1m9s Dist command failed to produce a tarball: make: *** [Makefile:38: dist] Error 128
dxf2gcode-upstream debianize 2021-04-03T13:29 3m1s FileNotFoundError: [Errno 2] No such file or directory: 'setup.py'
dxvk fresh-snapshots 2021-04-24T01:24 17m54s Dist command failed to produce a tarball: meson.build:86:0: ERROR: C++ shared or static library 'vulkan-1' not found
edac-utils fresh-snapshots 2021-03-24T15:09 4m23s Dist command failed: Dist command failed to produce a tarball: make[2]: *** No rule to make target 'udev.rules.in', needed by 'distdir'. Stop.
ember-upstream debianize 2021-05-12T20:41 2h23m Dist command failed to produce a tarball: ['autoconf', '-f'] failed with unidentified error (return code 1)
enigmail fresh-snapshots 2021-04-24T01:16 6m47s Dist command failed to produce a tarball: Makefile:9: config/autoconf.mk: No such file or directory
eog fresh-snapshots 2021-03-26T18:58 1h11m Dist command failed to produce a tarball: meson.build:169:2: ERROR: Assert failed: xdg-desktop-portal support requested but library not found. Please use -Dlibportal=false
epigrass-upstream debianize 2021-04-24T19:08 1m57s FileNotFoundError: [Errno 2] No such file or directory: 'requirements.txt'
eris-upstream debianize 2021-04-22T19:29 16s Dist command failed to produce a tarball: aclocal not found
esys-particle fresh-snapshots 2021-04-24T02:54 23m58s Dist command failed to produce a tarball: configure: error: cannot find the flags to link with Boost python
exif-upstream debianize 2021-04-23T03:38 3h36m Dist command failed to produce a tarball: configure.ac:60: warning: PKG_PROG_PKG_CONFIG is m4_require'd but not m4_defun'd
feh fresh-snapshots 2021-04-09T20:11 1m2s Dist command failed to produce a tarball: mkdir: cannot create directory '/tmp/feh-3.6.3': File exists
fence-agents fresh-snapshots 2021-04-09T09:35 3m24s Dist command failed to produce a tarball: configure: error:
festival fresh-snapshots 2021-04-16T14:53 4m5s Dist command failed to produce a tarball: Makefile:88: ../speech_tools/config/rules/install.mak: No such file or directory
ffindex-upstream debianize 2021-04-22T19:23 5s Dist command failed to produce a tarball: make[1]: *** No rule to make target 'dist'. Stop.
fflas-ffpack-upstream debianize 2021-05-15T00:56 5h22m Dist command failed to produce a tarball: ['autoconf', '-f'] failed with unidentified error (return code 1)
ffmpeg-upstream debianize 2021-04-22T19:20 29m50s Dist command failed to produce a tarball: libavutil/Makefile:1: libavutil/../config.mak: No such file or directory
fftw fresh-snapshots 2021-04-24T03:33 2m13s Dist command failed to produce a tarball: ! Emergency stop.
fftw3 fresh-snapshots 2021-03-29T17:31 5m17s Dist command failed to produce a tarball: Makefile.am: error: required file './ChangeLog' not found
fitscut fresh-snapshots 2021-04-27T01:17 17s Dist command failed to produce a tarball: configure: error: libwcs is required to build fitscut
fitscut-upstream debianize 2021-04-23T03:39 5s Dist command failed to produce a tarball: configure: error: png.h is required to build fitscut
fityk fresh-snapshots 2021-04-16T13:48 3m35s Dist command failed to produce a tarball: make[2]: *** No rule to make target 'tests/catch.hpp', needed by 'distdir-am'. Stop.
fityk-upstream debianize 2021-04-22T19:19 1m45s Dist command failed to produce a tarball: configure: error: Boost::Math headers not found. Make sure you have Boost installed.
flamerobin fresh-snapshots 2021-04-24T04:53 5m39s Dist command failed to produce a tarball: configure: error: cannot find Boost headers version >= 0.0.0
fonts-ibm-plex fresh-snapshots 2021-04-16T17:14 19h58m Dist command failed to produce a tarball: npm ERR! code 1
fplll-upstream debianize 2021-03-23T20:14 40s Dist command failed: Dist command failed to produce a tarball: command ['./autogen.sh'] failed with unidentified error (return code 1)
fprintd fresh-snapshots 2021-04-22T01:11 1m46s Dist command failed to produce a tarball: ../dist-unpack/fprintd-1.90.9/src/device.c:312:7: error: implicit declaration of function ‘fp_device_has_feature’; did you mean ‘fp_device_capture’? [-Werror=implicit-function-declaration]
freefem++ fresh-snapshots 2021-04-23T23:12 1h17m Dist command failed to produce a tarball: make[2]: *** No rule to make target 'etc/debian/freefem++-doc.doc-base', needed by 'distdir-am'. Stop.
freewheeling-upstream debianize 2021-04-24T20:18 9s Dist command failed to produce a tarball: configure: error: You need nettle-dev installed
fribidi fresh-snapshots 2021-04-22T04:19 54s Dist command failed to produce a tarball: doc/meson.build:33:4: ERROR: Problem encountered: c2man is required to build documentation from git. Or disable with -Ddocs=false
fritzing fresh-snapshots 2021-04-24T06:34 10m57s Dist command failed to produce a tarball: Project ERROR: libgit2 include path not found in /build/tmp94vnli4d/fritzing/../libgit2/include
frozen-bubble-upstream debianize 2021-04-22T14:38 2m14s Dist command failed to produce a tarball: ['perl', 'Build.PL'] failed with unidentified error (return code 2)
fsvs fresh-snapshots 2021-03-29T17:02 1m5s Dist command failed to produce a tarball: make[1]: *** No rule to make target 'dist'. Stop.
funny-manpages fresh-snapshots 2021-04-16T19:49 59s Dist command failed to produce a tarball: make: *** [Makefile:31: dist] Error 2
funtools fresh-snapshots 2021-04-16T17:09 40s Dist command failed to produce a tarball: ['autoreconf', '-i'] failed with unidentified error (return code 1)
funtools-upstream debianize 2021-03-23T19:54 1m57s Dist command failed: Dist command failed to produce a tarball: command ['autoreconf', '-i'] failed with unidentified error (return code 1)
fyba fresh-snapshots 2021-03-29T13:55 1m38s Dist command failed to produce a tarball: configure: error: cannot find install-sh or install.sh in . ./.. ./../..
fyba-upstream debianize 2021-03-23T19:49 36s Dist command failed: Dist command failed to produce a tarball: configure: error: cannot find install-sh or install.sh in . ./.. ./../..
gap-float fresh-snapshots 2021-04-24T04:21 16m46s Dist command failed to produce a tarball: configure: error: Unable to find GAP root directory
gcr fresh-snapshots 2021-04-04T19:28 2m34s Dist command failed to produce a tarball: ninja: build stopped: subcommand failed.
gelemental-upstream debianize 2021-04-22T14:36 1m14s Dist command failed to produce a tarball: configure: error: in `/build/tmpa4n5tf47/package':
gem fresh-snapshots 2021-04-16T18:38 5m26s Dist command failed to produce a tarball: make[4]: *** No rule to make target 'Gem/libGem.la', needed by 'version_current.h'. Stop.
giac fresh-snapshots 2021-04-27T02:10 17m9s Dist command failed to produce a tarball: configure.ac:495: error: required file 'debian/Makefile.in' not found
gitinspector-upstream debianize 2021-03-25T20:56 18m27s Dist command failed to produce a tarball: TypeError: 'bool' object is not iterable
giza-upstream debianize 2021-04-02T20:13 14s Dist command failed to produce a tarball: cp: cannot stat './README': No such file or directory
glib2.0 fresh-snapshots 2021-03-29T13:23 29m49s Dist command failed to produce a tarball: ninja: build stopped: subcommand failed.
glib-networking fresh-snapshots 2021-04-06T23:53 1m36s Dist command failed to produce a tarball: meson.build:51:0: ERROR: Neither a subproject directory nor a glib.wrap file was found.
gmpc fresh-snapshots 2021-04-27T00:50 1m33s Dist command failed to produce a tarball: ['./autogen.sh'] failed with unidentified error (return code 1)
gnome-boxes fresh-snapshots 2021-04-13T01:55 12m47s Dist command failed to produce a tarball: ['apt', '-y', 'satisfy', 'libvirt-glib-1.0-dev (>= 4.0.0)'] failed with unidentified error (return code 100)
gnome-color-manager fresh-snapshots 2021-03-26T23:28 1h47m Dist command failed to produce a tarball: ninja: build stopped: subcommand failed.
gnome-packagekit fresh-snapshots 2021-04-16T19:48 6m29s Dist command failed to produce a tarball: ninja: build stopped: subcommand failed.
gnome-shell-pomodoro fresh-snapshots 2021-04-16T14:14 3m59s Dist command failed to produce a tarball: ninja: build stopped: subcommand failed.
gnome-split fresh-snapshots 2021-04-30T19:09 2m20s Dist command failed to produce a tarball: ['make', 'dist'] failed with unidentified error (return code 2)
gnome-video-arcade fresh-snapshots 2021-03-30T18:03 2h17m Dist command failed to produce a tarball: gcc: error: ../../src/gva-audit.o: No such file or directory
gnuplot-upstream debianize 2021-04-22T22:47 12m11s Dist command failed to produce a tarball: configure.ac:1109: error: required file 'term/Makefile.in' not found
golang-github-apex-log-upstream debianize 2021-03-23T20:16 6s Dist command failed: Dist command failed to produce a tarball: Makefile:2: github.com/tj/make/golang: No such file or directory
golang-github-google-certificate-transparency fresh-snapshots 2021-04-22T03:39 1m31s Dist command failed to produce a tarball: configure: error: libevent headers could not be found
goldencheetah fresh-snapshots 2021-04-16T07:07 12m6s Dist command failed to produce a tarball: Project ERROR: Unknown module(s) in QT: webengine webenginecore webenginewidgets webchannel positioning
gp-saml-gui-upstream debianize 2021-05-04T05:56 4m49s FileNotFoundError: [Errno 2] No such file or directory: 'requirements.txt'
grads fresh-snapshots 2021-04-24T05:01 1m49s Dist command failed to produce a tarball: make[1]: *** No rule to make target 'ChangeLog', needed by 'distdir'. Stop.
grass fresh-snapshots 2021-04-24T10:28 34m39s Dist command failed to produce a tarball: KeyError: 'build-system'
grass-upstream debianize 2021-05-04T01:10 22m13s Dist command failed to produce a tarball: include/Make/Vars.make:1: include/Make/Platform.make: No such file or directory
grilo-plugins fresh-snapshots 2021-04-16T05:18 3m12s Dist command failed to produce a tarball: ninja: build stopped: subcommand failed.
grpc-java-upstream debianize 2021-05-04T00:44 5m42s Dist command failed to produce a tarball: ['./gradlew', 'distTar'] failed with unidentified error (return code 1)
gsound fresh-snapshots 2021-04-22T04:12 1m46s Dist command failed to produce a tarball: ['./autogen.sh'] failed with unidentified error (return code 1)
gtkmm-documentation fresh-snapshots 2021-03-23T17:44 56m19s Dist command failed: Dist command failed to produce a tarball: FileNotFoundError: [Errno 2] No such file or directory: 'docs/tutorial/index.docbook'
gtksourceview3 fresh-snapshots 2021-04-19T22:27 7m30s Dist command failed to produce a tarball: ninja: build stopped: subcommand failed.
guake fresh-snapshots 2021-04-26T23:26 57s Dist command failed to produce a tarball: Exception: Versioning for this project requires either an sdist tarball, or access to an upstream git repository. It's also possible that there is a mismatch between the package name in setup.cfg and the argument given to pbr.version.VersionInfo. Project name guake was given, but was not able to be found.
gubbins-upstream debianize 2021-05-15T00:25 19h52m Dist command failed to produce a tarball: ['autoconf', '-f'] failed with unidentified error (return code 1)
gucharmap fresh-snapshots 2021-04-24T07:20 12m45s Dist command failed to produce a tarball: gucharmap/meson.build:118:0: ERROR: Assert failed: must specify path to UCD files
gupnp-dlna fresh-snapshots 2021-03-27T19:03 56m10s Dist command failed to produce a tarball: libtool: error: cannot find the library '../../libgupnp-dlna/libgupnp-dlna-2.0.la' or unhandled argument '../../libgupnp-dlna/libgupnp-dlna-2.0.la'
gvfs fresh-snapshots 2021-03-27T01:04 1m45s Broken apt packages: command line argument : Depends: libgdata-dev (>= 0.18) but it is not going to be installed
gweled fresh-snapshots 2021-04-24T09:58 4m15s Dist command failed to produce a tarball: configure: error: libcanberra is required to compile gweled
gyoto-upstream debianize 2021-04-23T11:18 1m11s Dist command failed to produce a tarball: configure: error: in `/build/tmpegjcggm2/package':
h5utils fresh-snapshots 2021-04-16T02:08 1m2s Dist command failed to produce a tarball: configure: error: hdf5 libraries are required for compilation
harp fresh-snapshots 2021-04-24T06:34 10m32s Dist command failed to produce a tarball: configure: error:
haveged fresh-snapshots 2021-04-08T19:29 1m15s Dist command failed to produce a tarball: make[2]: *** No rule to make target 'haveged.spec', needed by 'distdir-am'. Stop.
hfst fresh-snapshots 2021-04-16T05:43 5m43s Dist command failed to produce a tarball: make[2]: *** [Makefile:601: distdir-am] Error 1
hfst-ospell-upstream debianize 2021-04-23T11:07 5s Dist command failed to produce a tarball: ['./autogen.sh'] failed with unidentified error (return code 1)
hfst-upstream debianize 2021-04-23T11:08 1m33s Dist command failed to produce a tarball: ['./autogen.sh'] failed with unidentified error (return code 1)
hmmer-upstream debianize 2021-04-23T11:05 2m12s Dist command failed to produce a tarball: aclocal: error: configure.ac:64: file 'easel/m4/ax_compiler_vendor.m4' does not exist
htseq-upstream debianize 2021-04-23T10:46 1m16s Dist command failed to produce a tarball: ['python3', './setup.py', 'sdist'] failed with unidentified error (return code 1)
hwloc fresh-snapshots 2021-04-07T03:47 7m1s Dist command failed to produce a tarball: make[3]: *** [Makefile:1092: dist-hook] Error 1
ibus fresh-snapshots 2021-04-24T07:21 12m7s Dist command failed to produce a tarball: Not found gnome-autogen.sh. You may need to install gnome-common
icoutils fresh-snapshots 2021-04-19T22:36 49s Dist command failed to produce a tarball: configure.ac:24: error: expected source file, required through AC_LIBSOURCES, not found
influxdb-python-upstream debianize 2021-04-23T10:23 1m26s NameError: name 'find_packages' is not defined
inhomog-upstream debianize 2021-04-23T10:22 42s Dist command failed to produce a tarball: configure: error: Could not find gsl. Hint (1) find /usr -name "*gsl*" -print Hint (2) install gsl*.a e.g. from http://www.gnu.org/software/gsl/ and put it in /usr/local/lib/ or set environment variable LDFLAGS to be -L/my/directory/lib/ with the library and CFLAGS to be -I/my/directory/include for the include files.
inotify-tools fresh-snapshots 2021-04-24T05:02 1m8s Dist command failed to produce a tarball: cp: cannot stat './README': No such file or directory
insserv fresh-snapshots 2021-04-23T23:38 2m33s Dist command failed to produce a tarball: gpg: signing failed: Inappropriate ioctl for device
intltool fresh-snapshots 2021-04-15T23:09 4m12s Dist command failed to produce a tarball: make[2]: *** [Makefile:905: ChangeLog] Error 1
ioping fresh-snapshots 2021-04-09T20:22 1m2s Dist command failed to produce a tarball: tar: checkver: Cannot stat: No such file or directory
iprange fresh-snapshots 2021-03-26T17:25 7m56s Dist command failed to produce a tarball: configure: error: docs not built, use '--disable-man' or --enable-maintainer-mode
iptables fresh-snapshots 2021-03-27T23:17 5m25s Dist command failed to produce a tarball: make[3]: *** No rule to make target 'distdir'. Stop.
ir.lv2-upstream debianize 2021-04-23T09:37 33s Dist command failed to produce a tarball: Makefile:27: *** "At least GTK+ version 2.16 is needed to build IR.". Stop.
iverilog-upstream debianize 2021-05-01T04:39 2m34s Dist command failed to produce a tarball: ['autoreconf', '-i'] failed with unidentified error (return code 1)
jabref-upstream debianize 2021-05-01T04:38 10m59s Dist command failed to produce a tarball: ['./gradlew', 'distTar'] failed with unidentified error (return code 1)
jansson fresh-snapshots 2021-03-28T04:58 1m5s Dist command failed to produce a tarball: make[4]: *** No rule to make target 'portability.rst', needed by 'distdir-am'. Stop.
java-atk-wrapper-upstream debianize 2021-05-01T04:30 45s Dist command failed to produce a tarball: *** No autoreconf found, please intall it ***
jpy fresh-snapshots 2021-04-30T19:13 21m37s Dist command failed to produce a tarball: Error: environment variable "JAVA_HOME" must be set to a JDK (>= v1.7) installation directory
jpy-upstream debianize 2021-05-01T04:29 1m7s Dist command failed to produce a tarball: Error: environment variable "JAVA_HOME" must be set to a JDK (>= v1.7) installation directory
jq fresh-snapshots 2021-04-24T09:41 9m2s Dist command failed to produce a tarball: make[3]: *** No rule to make target 'distdir'. Stop.
jupyter-notebook-upstream debianize 2021-04-23T05:15 3m12s Dist command failed to produce a tarball: error: [Errno 2] No such file or directory: 'bower'
kafkacat fresh-snapshots 2021-04-16T09:59 34s Dist command failed to produce a tarball: mklove/Makefile.base:25: Makefile.config: No such file or directory
kalign-upstream debianize 2021-05-01T04:10 7s Dist command failed to produce a tarball: ['./autogen.sh'] failed with unidentified error (return code 1)
kitty fresh-snapshots 2021-04-09T10:44 9m13s Dist command failed to produce a tarball: setup.py: error: argument action: invalid choice: 'sdist' (choose from 'build', 'test', 'linux-package', 'kitty.app', 'linux-freeze', 'macos-freeze', 'build-launcher', 'build-frozen-launcher', 'clean', 'export-ci-bundles')
kronosnet fresh-snapshots 2021-03-27T23:05 1m39s Dist command failed to produce a tarball: configure.ac:22: error: AC_INIT should be called with package and version arguments
kstart fresh-snapshots 2021-03-28T06:52 6m34s Dist command failed to produce a tarball: make[2]: *** No rule to make target 'docs/k5start.1', needed by 'distdir-am'. Stop.
lapack fresh-snapshots 2021-04-24T08:39 8m33s Dist command failed to produce a tarball: Makefile:6: make.inc: No such file or directory
libalien-gnuplot-perl-upstream debianize 2021-04-23T05:08 2m8s Dist command failed to produce a tarball: E: Unable to acquire the dpkg frontend lock (/var/lib/dpkg/lock-frontend), are you root?
libalien-sdl-perl-upstream debianize 2021-04-23T05:07 2m17s Dist command failed to produce a tarball: ['perl', 'Build.PL'] failed with unidentified error (return code 2)
libambix-upstream debianize 2021-04-23T05:03 6h21m Dist command failed to produce a tarball: E: /var/lib/schroot/session/unstable-amd64-sbuild-81fbccf3-64f8-4097-8cc6-4d512c9b3845: Failed to stat file: No such file or directory
libanyevent-redis-perl-upstream debianize 2021-05-04T17:37 46s Dist command failed to produce a tarball: ['perl', 'Makefile.PL'] failed with unidentified error (return code 255)
libapp-cmd-plugin-prompt-perl-upstream debianize 2021-04-23T05:04 3m24s Dist command failed to produce a tarball: ['/usr/bin/dzil', 'build', '--tgz'] failed with unidentified error (return code 255)
libapp-fatpacker-perl-upstream debianize 2021-04-23T05:00 1m27s Dist command failed to produce a tarball: do "maint/Makefile.PL.include" failed, '.' is no longer in @INC; did you mean do "./maint/Makefile.PL.include"? at Makefile.PL line 7.
libapp-perlrdf-command-query-perl-upstream debianize 2021-04-14T14:21 1m16s Dist command failed to produce a tarball: ['/usr/bin/distinkt-dist'] failed with unidentified error (return code 255)
libarchive fresh-snapshots 2021-03-24T15:21 17m53s Dist command failed: Dist command failed to produce a tarball: make[4]: *** [Makefile:6: archive_entry.3.html] Error 3
libattean-perl-upstream debianize 2021-05-01T03:21 51s Dist command failed to produce a tarball: ['perl', 'Makefile.PL'] failed with unidentified error (return code 2)
libatteanx-compatibility-trine-perl-upstream debianize 2021-05-01T03:20 1m1s Dist command failed to produce a tarball: ['/usr/bin/distinkt-dist'] failed with unidentified error (return code 255)
libatteanx-endpoint-perl-upstream debianize 2021-05-01T03:20 43s Dist command failed to produce a tarball: ['perl', 'Makefile.PL'] failed with unidentified error (return code 25)
libatteanx-parser-jsonld-perl-upstream debianize 2021-05-01T03:19 42s Dist command failed to produce a tarball: ['perl', 'Makefile.PL'] failed with unidentified error (return code 2)
libatteanx-serializer-rdfa-perl-upstream debianize 2021-05-01T03:18 5m10s Dist command failed to produce a tarball: ['/usr/bin/distinkt-dist'] failed with unidentified error (return code 9)
libatteanx-store-dbi-perl-upstream debianize 2021-05-01T03:18 45s Dist command failed to produce a tarball: ['perl', 'Makefile.PL'] failed with unidentified error (return code 25)
libatteanx-store-ldf-perl-upstream debianize 2021-05-01T03:15 2m27s dzil authordeps only works on dist.ini files, and you don't have one
libatteanx-store-lmdb-perl-upstream debianize 2021-05-04T17:22 40s Dist command failed to produce a tarball: ['perl', 'Makefile.PL'] failed with unidentified error (return code 2)
libatteanx-store-sparql-perl-upstream debianize 2021-05-04T17:36 9m40s Dist command failed to produce a tarball: ['/usr/bin/distinkt-dist'] failed with unidentified error (return code 9)
libautobox-junctions-perl-upstream debianize 2021-04-25T08:39 3m51s Dist command failed to produce a tarball: ['/usr/bin/dzil', 'build', '--tgz'] failed with unidentified error (return code 255)
libbenchmark-timer-perl-upstream debianize 2021-04-23T04:46 1m30s Dist command failed to produce a tarball: ['perl', 'Makefile.PL'] failed with unidentified error (return code 25)
libb-hooks-endofscope-perl fresh-snapshots 2021-04-09T18:58 7m27s Dist command failed to produce a tarball: ['/usr/bin/dzil', 'build', '--tgz'] failed with unidentified error (return code 2)
libbio-coordinate-perl fresh-snapshots 2021-04-17T00:49 2d8h Dist command failed to produce a tarball: ['apt', '-y', 'satisfy', 'debhelper-compat (= 13)', 'bioperl (>= 1.7.1),\n perl'] failed with unidentified error (return code 1)
libbiod fresh-snapshots 2021-04-24T10:14 2m15s Dist command failed to produce a tarball: ninja: build stopped: subcommand failed.
libcairo-perl-upstream debianize 2021-04-23T04:27 1m23s Dist command failed to produce a tarball: ['perl', 'Makefile.PL'] failed with unidentified error (return code 25)
libcanberra fresh-snapshots 2021-03-24T14:07 4m34s Dist command failed: Dist command failed to produce a tarball: make[3]: *** No rule to make target 'README'. Stop.
libcapture-tiny-perl-upstream debianize 2021-04-25T08:14 3m1s Dist command failed to produce a tarball: [DZ] no version was ever set
libcatalyst-perl-upstream debianize 2021-04-25T07:43 1m4s Dist command failed to produce a tarball: ['perl', 'Makefile.PL'] failed with unidentified error (return code 2)
libcatalyst-plugin-session-perl fresh-snapshots 2021-04-16T10:30 1m11s Dist command failed to produce a tarball: ['perl', 'Makefile.PL'] failed with unidentified error (return code 2)
libcatmandu-atom-perl-upstream debianize 2021-04-25T07:27 1m29s Dist command failed to produce a tarball: ['/usr/bin/dzil', 'build', '--tgz'] failed with unidentified error (return code 255)
libcatmandu-filestore-perl-upstream debianize 2021-04-25T07:26 1m32s Dist command failed to produce a tarball: ['/usr/bin/dzil', 'build', '--tgz'] failed with unidentified error (return code 255)
libcatmandu-importer-getjson-perl-upstream debianize 2021-04-23T04:22 2m5s Dist command failed to produce a tarball: ['/usr/bin/dzil', 'build', '--tgz'] failed with unidentified error (return code 255)
libcatmandu-marc-perl-upstream debianize 2021-04-23T04:20 2m39s Dist command failed to produce a tarball: ['/usr/bin/dzil', 'build', '--tgz'] failed with unidentified error (return code 255)
libcatmandu-mods-perl-upstream debianize 2021-04-23T04:27 1m48s No such action 'distmeta'
libcatmandu-perl-upstream debianize 2021-04-23T04:27 3m11s Dist command failed to produce a tarball: ['/usr/bin/dzil', 'build', '--tgz'] failed with unidentified error (return code 255)
libcatmandu-sru-perl-upstream debianize 2021-04-23T04:25 2m3s Dist command failed to produce a tarball: ['/usr/bin/dzil', 'build', '--tgz'] failed with unidentified error (return code 255)
libcatmandu-store-elasticsearch-perl-upstream debianize 2021-04-23T04:24 2m19s Dist command failed to produce a tarball: ['/usr/bin/dzil', 'build', '--tgz'] failed with unidentified error (return code 255)
libcatmandu-store-mongodb-perl-upstream debianize 2021-04-23T04:22 2m16s Dist command failed to produce a tarball: ['/usr/bin/dzil', 'build', '--tgz'] failed with unidentified error (return code 255)
libcatmandu-wikidata-perl-upstream debianize 2021-04-23T04:24 2m23s Dist command failed to produce a tarball: ['/usr/bin/dzil', 'build', '--tgz'] failed with unidentified error (return code 255)
libcatmandu-xml-perl-upstream debianize 2021-04-23T04:22 1m42s No such action 'distmeta'
libcatmandu-xsd-perl-upstream debianize 2021-04-23T04:22 2m1s Dist command failed to produce a tarball: ['/usr/bin/dzil', 'build', '--tgz'] failed with unidentified error (return code 255)
libcgi-application-dispatch-perl-upstream debianize 2021-04-23T21:25 4s Dist command failed to produce a tarball: Can't locate object method "new" via package "Module::Build" at Build.PL line 10.
libcgi-fast-perl-upstream debianize 2021-04-23T04:16 1m44s Dist command failed to produce a tarball: Execution of Makefile.PL aborted due to compilation errors.
libcgi-psgi-perl fresh-snapshots 2021-04-16T23:46 1m23s Dist command failed to produce a tarball: ['perl', 'Makefile.PL'] failed with unidentified error (return code 25)
libcgi-psgi-perl-upstream debianize 2021-04-16T23:09 1m7s Dist command failed to produce a tarball: ['perl', 'Makefile.PL'] failed with unidentified error (return code 25)
libchart-clicker-perl-upstream debianize 2021-04-25T06:58 1m20s Dist command failed to produce a tarball: ['/usr/bin/dzil', 'build', '--tgz'] failed with unidentified error (return code 255)
libchild-perl-upstream debianize 2021-04-23T17:47 7m5s dzil authordeps only works on dist.ini files, and you don't have one
libcifpp-upstream debianize 2021-04-23T04:14 1m0s Dist command failed to produce a tarball: configure: error: Sorry, your boost is not found or not up-to-date.
libclass-accessor-class-perl-upstream debianize 2021-04-23T00:20 1m52s Dist command failed to produce a tarball: ['/usr/bin/dzil', 'build', '--tgz'] failed with unidentified error (return code 255)
libclass-accessor-lite-perl-upstream debianize 2021-04-25T06:34 27s Dist command failed to produce a tarball: ['perl', 'Makefile.PL'] failed with unidentified error (return code 25)
libclass-c3-perl-upstream debianize 2021-04-23T00:19 56s Dist command failed to produce a tarball: do "maint/Makefile.PL.include" failed, '.' is no longer in @INC; did you mean do "./maint/Makefile.PL.include"? at Makefile.PL line 70.
libclass-trigger-perl-upstream debianize 2021-04-25T00:44 49s Dist command failed to produce a tarball: make: *** [Makefile:534: Class-Trigger-0.13_01.tar.gz] Error 1
libclass-xsaccessor-perl-upstream debianize 2021-04-25T00:49 1m8s cpanfile: No such file or directory at /usr/share/perl5/Module/CPANfile.pm line 47.
libcode-tidyall-plugin-sortlines-naturally-perl-upstream debianize 2021-04-25T00:41 2m44s Dist command failed to produce a tarball: ['/usr/bin/dzil', 'build', '--tgz'] failed with unidentified error (return code 2)
libcolor-ansi-util-perl-upstream debianize 2021-04-25T00:34 8m12s Dist command failed to produce a tarball: GitHubMeta: no github account name found in URL 'https://github.com/perlancar/perl-Color-ANSI-Util.git/'
libcolor-rgb-util-perl-upstream debianize 2021-04-25T00:34 17m5s Dist command failed to produce a tarball: GitHubMeta: no github account name found in URL 'https://github.com/perlancar/perl-Color-RGB-Util.git/'
libcompiler-lexer-perl-upstream debianize 2021-04-25T00:39 1m56s Dist command failed to produce a tarball: ['minil', 'dist'] failed with unidentified error (return code 0)
libconfig-gitlike-perl-upstream debianize 2021-04-25T00:30 34s Dist command failed to produce a tarball: ['perl', 'Makefile.PL'] failed with unidentified error (return code 25)
libconfig-inifiles-perl-upstream debianize 2021-04-30T17:00 2m57s dzil authordeps only works on dist.ini files, and you don't have one
libconfig-merge-perl-upstream debianize 2021-04-23T18:22 4m9s dzil authordeps only works on dist.ini files, and you don't have one
libconfig-model-backend-yaml-perl-upstream debianize 2021-05-04T17:16 2m2s Dist command failed to produce a tarball: ['/usr/bin/dzil', 'build', '--tgz'] failed with unidentified error (return code 255)
libconfig-model-lcdproc-perl-upstream debianize 2021-04-23T18:14 3m32s Dist command failed to produce a tarball: ['/usr/bin/dzil', 'build', '--tgz'] failed with unidentified error (return code 2)
libconfig-model-openssh-perl-upstream debianize 2021-04-23T18:13 2m21s Dist command failed to produce a tarball: ['/usr/bin/dzil', 'build', '--tgz'] failed with unidentified error (return code 2)
libconfig-model-systemd-perl-upstream debianize 2021-04-23T18:10 2m16s Dist command failed to produce a tarball: ['/usr/bin/dzil', 'build', '--tgz'] failed with unidentified error (return code 2)
libconfig-model-tkui-perl-upstream debianize 2021-04-23T18:09 4m8s dzil authordeps only works on dist.ini files, and you don't have one
libconfig-onion-perl-upstream debianize 2021-04-23T03:47 3m47s dzil authordeps only works on dist.ini files, and you don't have one
libconfig-zomg-perl-upstream debianize 2021-04-14T14:46 1m51s Dist command failed to produce a tarball: ['/usr/bin/dzil', 'build', '--tgz'] failed with unidentified error (return code 255)
libconst-fast-perl-upstream debianize 2021-04-14T18:19 4m17s Dist command failed to produce a tarball: E: session:unstable-amd64-sbuild-4ae47b98-50a3-4c55-9efe-cf4414a0c571: Chroot not found
libconvert-pem-perl-upstream debianize 2021-04-25T00:24 49s Dist command failed to produce a tarball: ['perl', 'Makefile.PL'] failed with unidentified error (return code 255)
libcpan-changes-perl fresh-snapshots 2021-03-28T02:21 7m53s Dist command failed to produce a tarball: do "maint/Makefile.PL.include" failed, '.' is no longer in @INC; did you mean do "./maint/Makefile.PL.include"? at Makefile.PL line 55.
libcpan-changes-perl-upstream debianize 2021-04-14T15:24 8s Dist command failed to produce a tarball: do "maint/Makefile.PL.include" failed, '.' is no longer in @INC; did you mean do "./maint/Makefile.PL.include"? at Makefile.PL line 55.
libcpan-checksums-perl-upstream debianize 2021-04-14T15:02 5s Dist command failed to produce a tarball: make: *** [Makefile:948: verify-changes-date] Error 22
libcpan-meta-yaml-perl fresh-snapshots 2021-04-16T08:23 11m7s Dist command failed to produce a tarball: ['/usr/bin/dzil', 'build', '--tgz'] failed with unidentified error (return code 2)
libcpan-meta-yaml-perl-upstream debianize 2021-04-25T00:20 13m3s Dist command failed to produce a tarball: ['/usr/bin/dzil', 'build', '--tgz'] failed with unidentified error (return code 2)
libcpanplus-dist-build-perl-upstream debianize 2021-05-04T19:08 59s Dist command failed to produce a tarball: Execution of Makefile.PL aborted due to compilation errors.
libcrypt-openssl-rsa-perl-upstream debianize 2021-05-04T19:10 2m24s cpanfile: No such file or directory at /usr/share/perl5/Module/CPANfile.pm line 47.
libcrypt-pbkdf2-perl fresh-snapshots 2021-04-16T09:07 3m22s Dist command failed to produce a tarball: ['/usr/bin/dzil', 'build', '--tgz'] failed with unidentified error (return code 2)
libcwd-guard-perl-upstream debianize 2021-04-14T14:47 56s Dist command failed to produce a tarball: Do not run distmeta. Install Minilla and `minil install` instead.
libdancer2-perl-upstream debianize 2021-04-25T00:11 7m36s dzil authordeps only works on dist.ini files, and you don't have one
libdancer-logger-psgi-perl-upstream debianize 2021-05-01T04:04 4m49s dzil authordeps only works on dist.ini files, and you don't have one
libdata-dump-oneline-perl-upstream debianize 2021-05-04T19:05 15m25s Dist command failed to produce a tarball: GitHubMeta: no github account name found in URL 'https://github.com/perlancar/perl-Data-Dump-OneLine.git/'
libdata-dump-streamer-perl-upstream debianize 2021-04-14T18:41 1m1s Dist command failed to produce a tarball: /usr/bin/eatmydata: 83: exec: ./Build: not found
libdata-messagepack-stream-perl-upstream debianize 2021-05-04T19:03 1m0s Dist command failed to produce a tarball: Need 'cmake' command for building Data::MessagePack::Stream
libdata-objectdriver-perl-upstream debianize 2021-04-25T00:08 54s Dist command failed to produce a tarball: ['perl', 'Makefile.PL'] failed with unidentified error (return code 255)
libdata-paginator-perl-upstream debianize 2021-04-14T18:57 5m46s dzil authordeps only works on dist.ini files, and you don't have one
libdata-perl-perl-upstream debianize 2021-04-14T14:39 6m3s Dist command failed to produce a tarball: ['/usr/bin/dzil', 'build', '--tgz'] failed with unidentified error (return code 2)
libdata-sah-normalize-perl-upstream debianize 2021-05-04T18:59 8m17s Dist command failed to produce a tarball: GitHubMeta: no github account name found in URL 'https://github.com/perlancar/perl-Data-Sah-Normalize.git/'
libdata-tablereader-perl-upstream debianize 2021-05-01T04:04 3m9s Dist command failed to produce a tarball: ['/usr/bin/dzil', 'build', '--tgz'] failed with unidentified error (return code 2)
libdata-validate-struct-perl-upstream debianize 2021-05-04T17:11 1m2s cpanfile: No such file or directory at /usr/share/perl5/Module/CPANfile.pm line 47.
libdata-walk-perl-upstream debianize 2021-04-23T03:50 1m11s Dist command failed to produce a tarball: ['./Build', 'dist'] failed with unidentified error (return code 2)
libdatetime-format-w3cdtf-perl-upstream debianize 2021-04-23T16:59 1m30s Dist command failed to produce a tarball: ['perl', 'Makefile.PL'] failed with unidentified error (return code 2)
libdbd-firebird-perl-upstream debianize 2021-04-14T13:45 45s Dist command failed to produce a tarball: ['perl', 'Makefile.PL'] failed with unidentified error (return code 2)
libdbd-mariadb-perl-upstream debianize 2021-05-01T04:02 1m7s Dist command failed to produce a tarball: ['perl', 'Makefile.PL'] failed with unidentified error (return code 2)
libdbd-oracle-perl-upstream debianize 2021-05-04T18:52 1m39s Dist command failed to produce a tarball: ['perl', 'Makefile.PL'] failed with unidentified error (return code 255)
libdbd-sqlite2-perl-upstream debianize 2021-05-01T03:53 37s Dist command failed to produce a tarball: ['perl', 'Makefile.PL'] failed with unidentified error (return code 2)
libdbix-abstract-perl-upstream debianize 2021-04-14T06:21 10m21s Dist command failed to produce a tarball: ['/usr/bin/dzil', 'build', '--tgz'] failed with unidentified error (return code 255)
libdbix-class-perl-upstream debianize 2021-04-23T06:50 1m47s Dist command failed to produce a tarball: make: *** [Makefile:1131: check_create_distdir_prereqs] Error 2
libdefhash-perl-upstream debianize 2021-04-23T06:48 10m18s Dist command failed to produce a tarball: GitHubMeta: no github account name found in URL 'https://github.com/perlancar/perl-DefHash.git/'
libdevel-autoflush-perl-upstream debianize 2021-04-23T06:46 3m50s Dist command failed to produce a tarball: [DZ] no version was ever set
libdevel-checkcompiler-perl-upstream debianize 2021-04-23T06:43 1m33s No such action 'distmeta'
libdevel-dprof-perl-upstream debianize 2021-04-14T02:44 44m11s Dist command failed to produce a tarball: ['/usr/bin/dzil', 'build', '--tgz'] failed with unidentified error (return code 255)
libdevel-overrideglobalrequire-perl-upstream debianize 2021-04-14T13:08 8m53s Dist command failed to produce a tarball: ['/usr/bin/dzil', 'build', '--tgz'] failed with unidentified error (return code 255)
libdevel-partialdump-perl-upstream debianize 2021-05-04T18:50 5m19s Dist command failed to produce a tarball: ['/usr/bin/dzil', 'build', '--tgz'] failed with unidentified error (return code 2)
libdevice-cdio-perl-upstream debianize 2021-04-14T12:59 22m40s Dist command failed to produce a tarball: ['./Build', 'dist'] failed with unidentified error (return code 2)
libdigest-jhash-perl-upstream debianize 2021-04-14T11:17 1m53s dzil authordeps only works on dist.ini files, and you don't have one
libdist-inkt-doap-perl-upstream debianize 2021-04-23T06:39 1m14s Dist command failed to produce a tarball: ['/usr/bin/distinkt-dist'] failed with unidentified error (return code 255)
libdist-inkt-role-git-perl-upstream debianize 2021-04-23T06:41 5m35s Dist command failed to produce a tarball: ['/usr/bin/distinkt-dist'] failed with unidentified error (return code 9)
libdist-metadata-perl-upstream debianize 2021-04-23T06:37 5m11s Dist command failed to produce a tarball: ['/usr/bin/dzil', 'build', '--tgz'] failed with unidentified error (return code 255)
libdist-zilla-config-slicer-perl-upstream debianize 2021-04-14T10:19 1h6m Dist command failed to produce a tarball: ['/usr/bin/dzil', 'build', '--tgz'] failed with unidentified error (return code 255)
libdist-zilla-localetextdomain-perl-upstream debianize 2021-04-23T15:14 3m23s dzil authordeps only works on dist.ini files, and you don't have one
libdist-zilla-plugin-bugtracker-perl-upstream debianize 2021-04-23T06:34 3m24s Dist command failed to produce a tarball: ['/usr/bin/dzil', 'build', '--tgz'] failed with unidentified error (return code 255)
libdist-zilla-plugin-config-git-perl-upstream debianize 2021-04-23T06:32 5m41s Dist command failed to produce a tarball: ['/usr/bin/dzil', 'build', '--tgz'] failed with unidentified error (return code 255)
libdist-zilla-plugin-minimumperlfast-perl-upstream debianize 2021-05-04T18:46 3m32s Dist command failed to produce a tarball: ['/usr/bin/dzil', 'build', '--tgz'] failed with unidentified error (return code 2)
libdist-zilla-plugin-ourpkgversion-perl-upstream debianize 2021-04-09T18:44 21m15s Dist command failed to produce a tarball: ['/usr/bin/dzil', 'build', '--tgz'] failed with unidentified error (return code 2)
libdist-zilla-plugin-prepender-perl-upstream debianize 2021-04-09T18:33 4m2s Dist command failed to produce a tarball: ['/usr/bin/dzil', 'build', '--tgz'] failed with unidentified error (return code 255)
libdist-zilla-plugins-cjm-perl-upstream debianize 2021-04-09T16:08 3m19s dzil authordeps only works on dist.ini files, and you don't have one
libdist-zilla-plugin-templatefiles-perl-upstream debianize 2021-04-23T06:25 1m34s Dist command failed to produce a tarball: ['/usr/bin/dzil', 'build', '--tgz'] failed with unidentified error (return code 128)
libdist-zilla-plugin-test-eol-perl-upstream debianize 2021-04-23T06:23 1m26s Dist command failed to produce a tarball: ['cpan', '-i', '-T', 'Dist::Zilla::PluginBundle::Author::ETHER'] failed with unidentified error (return code 1)
libdist-zilla-plugin-test-kwalitee-perl-upstream debianize 2021-04-23T06:22 1m54s Dist command failed to produce a tarball: !!! [EOLTests] is deprecated and may be removed in a future release; replace it with [Test::EOL] (note the different default filename)
libdist-zilla-plugin-twitter-perl-upstream debianize 2021-05-04T18:45 3m22s Dist command failed to produce a tarball: [DZ] no version was ever set
libdist-zilla-role-pluginbundle-pluginremover-perl-upstream debianize 2021-05-04T12:04 7m30s Dist command failed to produce a tarball: ['/usr/bin/dzil', 'build', '--tgz'] failed with unidentified error (return code 255)
libdpkg-parse-perl-upstream debianize 2021-04-14T11:33 56m53s Dist command failed to produce a tarball: ['/usr/bin/dzil', 'build', '--tgz'] failed with unidentified error (return code 2)
libemail-localdelivery-perl-upstream debianize 2021-05-04T18:43 3m9s Dist command failed to produce a tarball: ['/usr/bin/dzil', 'build', '--tgz'] failed with unidentified error (return code 255)
libemail-thread-perl-upstream debianize 2021-04-23T21:20 5m27s Dist command failed to produce a tarball: ['/usr/bin/dzil', 'build', '--tgz'] failed with unidentified error (return code 255)
libencode-base58-perl-upstream debianize 2021-04-23T16:59 1m50s Dist command failed to produce a tarball: ['perl', 'Makefile.PL'] failed with unidentified error (return code 255)
liberror-perl-upstream debianize 2021-04-23T12:07 36s dzil authordeps only works on dist.ini files, and you don't have one
libexception-class-trycatch-perl-upstream debianize 2021-04-14T10:41 8m10s Dist command failed to produce a tarball: ['/usr/bin/dzil', 'build', '--tgz'] failed with unidentified error (return code 255)
libfailures-perl-upstream debianize 2021-04-23T06:13 4m29s Dist command failed to produce a tarball: [DZ] no version was ever set
libfastjson fresh-snapshots 2021-03-27T19:37 1m23s Dist command failed to produce a tarball: make[4]: *** No rule to make target '../libfastjson.la', needed by 'chk_version'. Stop.
libfcgi-perl-upstream debianize 2021-05-01T01:19 5h5m Dist command failed to produce a tarball: ['autoconf', '-f'] failed with unidentified error (return code 1)
libfile-chmod-perl-upstream debianize 2021-04-23T06:14 4m1s Dist command failed to produce a tarball: ['/usr/bin/dzil', 'build', '--tgz'] failed with unidentified error (return code 2)
libfile-flock-retry-perl-upstream debianize 2021-04-23T06:14 10m25s Dist command failed to produce a tarball: GitHubMeta: no github account name found in URL 'https://github.com/perlancar/perl-File-Flock-Retry.git/'
libfilehandle-unget-perl fresh-snapshots 2021-04-16T23:47 1m15s Dist command failed to produce a tarball: ['perl', 'Makefile.PL'] failed with unidentified error (return code 2)
libfile-libmagic-perl-upstream debianize 2021-04-23T07:13 49s Dist command failed to produce a tarball: ['perl', 'Makefile.PL'] failed with unidentified error (return code 1)
libfile-mmagic-xs-perl-upstream debianize 2021-03-25T20:17 13s Dist command failed to produce a tarball: ['perl', 'Makefile.PL'] failed with unidentified error (return code 1)
libfile-sharedir-perl-upstream debianize 2021-04-14T06:35 1m57s Dist command failed to produce a tarball: File::ShareDir::Install is not installed at /usr/local/share/perl/5.32.1/inc/latest.pm line 91.
libfile-spec-native-perl-upstream debianize 2021-05-04T18:30 4m1s Dist command failed to produce a tarball: ['/usr/bin/dzil', 'build', '--tgz'] failed with unidentified error (return code 255)
libfile-util-perl-upstream debianize 2021-04-14T02:51 44m23s dzil authordeps only works on dist.ini files, and you don't have one
libfile-write-rotate-perl-upstream debianize 2021-04-23T07:19 8m31s Dist command failed to produce a tarball: GitHubMeta: no github account name found in URL 'https://github.com/sharyanto/perl-File-Write-Rotate.git/'
libfinance-quote-perl-upstream debianize 2021-04-23T07:21 3m3s dzil authordeps only works on dist.ini files, and you don't have one
libfunction-fallback-coreorpp-perl-upstream debianize 2021-04-23T07:16 9m29s Dist command failed to produce a tarball: GitHubMeta: no github account name found in URL 'https://github.com/perlancar/perl-Function-Fallback-CoreOrPP.git/'
libfurl-perl-upstream debianize 2021-04-23T07:16 1m46s No such action 'distmeta'
libgen-test-rinci-funcresult-perl-upstream debianize 2021-05-04T18:30 15m31s Dist command failed to produce a tarball: GitHubMeta: no github account name found in URL 'https://github.com/perlancar/perl-Gen-Test-Rinci-FuncResult.git/'
libgeo-shapelib-perl-upstream debianize 2021-04-14T06:52 2m52s Dist command failed to produce a tarball: ['perl', 'Makefile.PL'] failed with unidentified error (return code 2)
libgoogle-gson-java fresh-snapshots 2021-04-16T09:22 2m37s Dist command failed to produce a tarball: ['./gradlew', 'distTar'] failed with unidentified error (return code 1)
libgphoto2-upstream debianize 2021-04-23T07:02 54m55s Dist command failed to produce a tarball: configure.ac:342: warning: PKG_PROG_PKG_CONFIG is m4_require'd but not m4_defun'd
libgpuarray fresh-snapshots 2021-04-23T23:38 11m15s Dist command failed to produce a tarball: ValueError: Can't determine version for build: unable to compute version
libgpuarray-upstream debianize 2021-04-23T07:02 1m3s Dist command failed to produce a tarball: ValueError: Can't determine version for build: unable to compute version
libgraphics-color-perl-upstream debianize 2021-04-14T11:20 1h38m dzil authordeps only works on dist.ini files, and you don't have one
libgtextutils-upstream debianize 2021-05-01T00:52 6h20m Dist command failed to produce a tarball: ['autoconf', '-f'] failed with unidentified error (return code 1)
libhash-defhash-perl-upstream debianize 2021-05-01T05:35 9m25s Dist command failed to produce a tarball: GitHubMeta: no github account name found in URL 'https://github.com/perlancar/perl-Hash-DefHash.git/'
libhash-diff-perl-upstream debianize 2021-04-23T06:59 2m24s dzil authordeps only works on dist.ini files, and you don't have one
libhijk-perl-upstream debianize 2021-04-14T22:02 3m14s No such action 'distmeta'
libhmsbeagle-upstream debianize 2021-05-15T00:51 7h33m Dist command failed to produce a tarball: ['autoconf', '-f'] failed with unidentified error (return code 1)
libhook-lexwrap-perl-upstream debianize 2021-05-04T18:20 6m3s Dist command failed to produce a tarball: ['/usr/bin/dzil', 'build', '--tgz'] failed with unidentified error (return code 2)
libhtml-escape-perl-upstream debianize 2021-05-01T05:32 44s Dist command failed to produce a tarball: ['minil', 'dist'] failed with unidentified error (return code 0)
libhtml-format-perl-upstream debianize 2021-05-01T05:41 1m54s Dist command failed to produce a tarball: ['/usr/bin/dzil', 'build', '--tgz'] failed with unidentified error (return code 255)
libhtml-formfu-perl-upstream debianize 2021-05-01T05:33 2m2s Dist command failed to produce a tarball: ['/usr/bin/dzil', 'build', '--tgz'] failed with unidentified error (return code 255)
libhtml-html5-entities-perl fresh-snapshots 2021-04-16T04:12 3m37s Dist command failed to produce a tarball: ['/usr/bin/distinkt-dist'] failed with unidentified error (return code 255)
libhtml-html5-entities-perl-upstream debianize 2021-04-23T21:12 5m22s Dist command failed to produce a tarball: ['/usr/bin/distinkt-dist'] failed with unidentified error (return code 255)
libhtml-html5-sanity-perl fresh-snapshots 2021-04-23T21:12 6m17s Dist command failed to produce a tarball: ['/usr/bin/distinkt-dist'] failed with unidentified error (return code 255)
libhtml-html5-sanity-perl-upstream debianize 2021-05-01T05:24 1m12s Dist command failed to produce a tarball: ['/usr/bin/distinkt-dist'] failed with unidentified error (return code 255)
libhtml-linklist-perl-upstream debianize 2021-05-01T08:49 3m12s dzil authordeps only works on dist.ini files, and you don't have one
libhtml-scrubber-perl fresh-snapshots 2021-04-06T18:31 4m9s Dist command failed to produce a tarball: ['/usr/bin/dzil', 'build', '--tgz'] failed with unidentified error (return code 2)
libhtml-scrubber-perl-upstream debianize 2021-04-23T03:58 4m35s Dist command failed to produce a tarball: ['/usr/bin/dzil', 'build', '--tgz'] failed with unidentified error (return code 2)
libhtml-stripscripts-perl-upstream debianize 2021-05-01T05:26 2m36s dzil authordeps only works on dist.ini files, and you don't have one
libhtml-widgets-navmenu-perl-upstream debianize 2021-04-23T04:00 1m39s dzil authordeps only works on dist.ini files, and you don't have one
libhttp-link-parser-perl-upstream debianize 2021-04-14T11:22 3m24s Dist command failed to produce a tarball: ['/usr/bin/distinkt-dist'] failed with unidentified error (return code 2)
libhttp-multipartparser-perl-upstream debianize 2021-04-16T21:39 53s Dist command failed to produce a tarball: ['perl', 'Makefile.PL'] failed with unidentified error (return code 2)
libhttp-thin-perl-upstream debianize 2021-04-09T18:34 2m15s Dist command failed to produce a tarball: ['/usr/bin/dzil', 'build', '--tgz'] failed with unidentified error (return code 2)
libidn2 fresh-snapshots 2021-03-28T04:54 2h33m Dist command failed to produce a tarball: aclocal: error: couldn't open directory 'unistring/m4': No such file or directory
libidna-punycode-perl-upstream debianize 2021-05-01T05:15 32s Dist command failed to produce a tarball: ['./Build', 'dist'] failed with unidentified error (return code 2)
libimporter-perl-upstream debianize 2021-04-14T02:38 1h36m dzil authordeps only works on dist.ini files, and you don't have one
libimport-into-perl-upstream debianize 2021-05-01T05:09 41s Dist command failed to produce a tarball: do "maint/Makefile.PL.include" failed, '.' is no longer in @INC; did you mean do "./maint/Makefile.PL.include"? at Makefile.PL line 49.
libinline-java-perl-upstream debianize 2021-05-04T18:16 13s Dist command failed to produce a tarball: ['perl', 'Makefile.PL'] failed with unidentified error (return code 1)
libinline-python-perl-upstream debianize 2021-05-04T11:54 20s Dist command failed to produce a tarball: ['perl', 'Makefile.PL'] failed with unidentified error (return code 25)
libipc-run-perl-upstream debianize 2021-05-04T11:37 1m48s cpanfile: No such file or directory at /usr/share/perl5/Module/CPANfile.pm line 47.
libirc-utils-perl fresh-snapshots 2021-04-09T18:39 2m24s Dist command failed to produce a tarball: ['/usr/bin/dzil', 'build', '--tgz'] failed with unidentified error (return code 255)
libirc-utils-perl-upstream debianize 2021-05-04T18:10 1m56s Dist command failed to produce a tarball: ['/usr/bin/dzil', 'build', '--tgz'] failed with unidentified error (return code 255)
libiri-perl-upstream debianize 2021-05-04T11:33 1m15s Dist command failed to produce a tarball: ['perl', 'Makefile.PL'] failed with unidentified error (return code 2)
libjsonld-perl-upstream debianize 2021-04-23T17:06 2m49s Dist command failed to produce a tarball: ['perl', 'Makefile.PL'] failed with unidentified error (return code 2)
libjson-maybexs-perl-upstream debianize 2021-05-01T06:32 40s Dist command failed to produce a tarball: do "maint/Makefile.PL.include" failed, '.' is no longer in @INC; did you mean do "./maint/Makefile.PL.include"? at Makefile.PL line 4.
libjson-parse-perl-upstream debianize 2021-05-01T06:28 46s Dist command failed to produce a tarball: Could not open 'lib/JSON/Parse.pod': No such file or directory at /usr/local/share/perl/5.32.1/ExtUtils/MM_Unix.pm line 2929.
libjson-rpc-perl-upstream debianize 2021-05-01T06:25 47s Dist command failed to produce a tarball: Do not run distmeta. Install Minilla and `minil install` instead.
libjson-types-perl-upstream debianize 2021-05-01T06:24 2s Dist command failed to produce a tarball: ['perl', 'Makefile.PL'] failed with unidentified error (return code 255)
libjs-spin.js-upstream debianize 2021-04-14T06:55 6m22s Dist command failed to produce a tarball: npm ERR! code 99
libjs-webrtc-adapter-upstream debianize 2021-04-13T01:29 1h58m Dist command failed to produce a tarball: npm ERR! code 99
liblingua-en-nameparse-perl fresh-snapshots 2021-04-16T04:14 38s Dist command failed to produce a tarball: ['./Build', 'dist'] failed with unidentified error (return code 2)
liblingua-en-nameparse-perl-upstream debianize 2021-04-24T21:19 27s Dist command failed to produce a tarball: ['./Build', 'dist'] failed with unidentified error (return code 2)
liblingua-sentence-perl-upstream debianize 2021-05-01T04:50 34s cpanfile: No such file or directory at /usr/share/perl5/Module/CPANfile.pm line 47.
liblinux-epoll-perl-upstream debianize 2021-05-01T06:55 2m15s Dist command failed to produce a tarball: ['/usr/bin/dzil', 'build', '--tgz'] failed with unidentified error (return code 1)
liblist-moreutils-xs-perl-upstream debianize 2021-05-01T08:47 51s Dist command failed to produce a tarball: Capture::Tiny is not installed at /usr/local/share/perl/5.32.1/inc/latest.pm line 91.
liblocale-maketext-lexicon-perl-upstream debianize 2021-05-01T06:35 1m24s Dist command failed to produce a tarball: !!! [EOLTests] is deprecated and may be removed in a future release; replace it with [Test::EOL] (note the different default filename)
liblocale-subcountry-perl-upstream debianize 2021-04-30T16:43 46s Dist command failed to produce a tarball: ['./Build', 'dist'] failed with unidentified error (return code 2)
liblog-any-adapter-callback-perl-upstream debianize 2021-05-04T17:48 14m26s Dist command failed to produce a tarball: GitHubMeta: no github account name found in URL 'https://github.com/perlancar/perl-Log-Any-Adapter-Callback.git/'
liblog-any-adapter-filehandle-perl-upstream debianize 2021-05-04T17:46 2m30s Dist command failed to produce a tarball: ['/usr/bin/dzil', 'build', '--tgz'] failed with unidentified error (return code 255)
liblog-any-adapter-screen-perl-upstream debianize 2021-04-22T09:46 13m39s Dist command failed to produce a tarball: GitHubMeta: no github account name found in URL 'https://github.com/perlancar/perl-Log-Any-Adapter-ScreenColoredLevel.git/'
liblog-dispatch-array-perl-upstream debianize 2021-04-23T12:39 4m5s Dist command failed to produce a tarball: ['/usr/bin/dzil', 'build', '--tgz'] failed with unidentified error (return code 255)
liblog-dispatch-configurator-any-perl-upstream debianize 2021-04-23T12:37 2m34s Dist command failed to produce a tarball: ['/usr/bin/dzil', 'build', '--tgz'] failed with unidentified error (return code 255)
liblog-dispatch-dir-perl-upstream debianize 2021-04-23T12:33 8m31s Dist command failed to produce a tarball: GitHubMeta: no github account name found in URL 'https://github.com/perlancar/perl-Log-Dispatch-Dir.git/'
liblog-dispatch-filewriterotate-perl-upstream debianize 2021-04-23T12:24 8m39s Dist command failed to produce a tarball: GitHubMeta: no github account name found in URL 'https://github.com/perlancar/perl-Log-Dispatch-FileWriteRotate.git/'
liblo-upstream debianize 2021-05-01T06:41 8s Dist command failed to produce a tarball: ['./autogen.sh'] failed with unidentified error (return code 1)
liblv-perl-upstream debianize 2021-04-23T15:50 1m59s Dist command failed to produce a tarball: ['/usr/bin/distinkt-dist'] failed with unidentified error (return code 2)
liblwp-useragent-chicaching-perl-upstream debianize 2021-04-23T15:32 1m49s Dist command failed to produce a tarball: ['/usr/bin/distinkt-dist'] failed with unidentified error (return code 255)
libm4rie-upstream debianize 2021-05-01T01:36 11h53m Dist command failed to produce a tarball: ['autoconf', '-f'] failed with unidentified error (return code 1)
libmagpie-perl-upstream debianize 2021-04-23T15:26 1m17s Dist command failed to produce a tarball: ['/usr/bin/dzil', 'build', '--tgz'] failed with unidentified error (return code 2)
libmail-dkim-perl-upstream debianize 2021-04-23T15:17 2m15s Dist command failed to produce a tarball: ['/usr/bin/dzil', 'build', '--tgz'] failed with unidentified error (return code 2)
libmail-mbox-messageparser-perl fresh-snapshots 2021-04-22T03:55 1m37s Dist command failed to produce a tarball: ['perl', 'Makefile.PL'] failed with unidentified error (return code 2)
libmail-mbox-messageparser-perl-upstream debianize 2021-04-23T15:13 47s Dist command failed to produce a tarball: ['perl', 'Makefile.PL'] failed with unidentified error (return code 25)
libmason-perl-upstream debianize 2021-04-23T15:03 1m50s Dist command failed to produce a tarball: ['/usr/bin/dzil', 'build', '--tgz'] failed with unidentified error (return code 2)
libmason-plugin-cache-perl-upstream debianize 2021-04-23T15:00 3m37s dzil authordeps only works on dist.ini files, and you don't have one
libmason-plugin-routersimple-perl-upstream debianize 2021-04-24T21:08 9m6s dzil authordeps only works on dist.ini files, and you don't have one
libmatch-simple-perl-upstream debianize 2021-04-24T21:07 7m18s Dist command failed to produce a tarball: ['/usr/bin/distinkt-dist'] failed with unidentified error (return code 2)
libmath-gmp-perl-upstream debianize 2021-04-22T04:26 1m58s Dist command failed to produce a tarball: ['/usr/bin/dzil', 'build', '--tgz'] failed with unidentified error (return code 2)
libmath-gsl-perl-upstream debianize 2021-04-23T14:57 41s Dist command failed to produce a tarball: /usr/bin/eatmydata: 83: exec: ./Build: not found
libmath-int128-perl-upstream debianize 2021-04-23T14:57 7s Dist command failed to produce a tarball: ['perl', 'Makefile.PL'] failed with unidentified error (return code 1)
libmath-int64-perl-upstream debianize 2021-04-23T14:52 7s Dist command failed to produce a tarball: ['perl', 'Makefile.PL'] failed with unidentified error (return code 1)
libmath-random-isaac-perl-upstream debianize 2021-04-23T14:36 28s Dist command failed to produce a tarball: ['./Build', 'dist'] failed with unidentified error (return code 2)
libmath-random-oo-perl-upstream debianize 2021-04-23T14:31 3m10s Dist command failed to produce a tarball: [DZ] no version was ever set
libmenlo-legacy-perl-upstream debianize 2021-04-23T15:04 2m59s cpanfile: No such file or directory at /usr/share/perl5/Module/CPANfile.pm line 47.
libmenlo-perl-upstream debianize 2021-04-02T23:57 2m34s cpanfile: No such file or directory at /usr/share/perl5/Module/CPANfile.pm line 47.
libmessage-passing-amqp-perl-upstream debianize 2021-04-22T09:43 1m13s Dist command failed to produce a tarball: ['perl', 'Makefile.PL'] failed with unidentified error (return code 255)
libmixin-extrafields-perl-upstream debianize 2021-04-23T17:45 2m29s Dist command failed to produce a tarball: ['/usr/bin/dzil', 'build', '--tgz'] failed with unidentified error (return code 255)
libmnemonicsetter-java fresh-snapshots 2021-04-24T05:49 14m7s Dist command failed to produce a tarball: ['gradle', 'distTar'] failed with unidentified error (return code 1)
libmods-record-perl-upstream debianize 2021-04-23T14:37 1m42s Dist command failed to produce a tarball: ['/usr/bin/dzil', 'build', '--tgz'] failed with unidentified error (return code 255)
libmodule-build-pluggable-perl-upstream debianize 2021-04-23T14:31 48s Dist command failed to produce a tarball: Do not run distmeta. Install Minilla and `minil install` instead.
libmodule-build-xsutil-perl-upstream debianize 2021-04-22T06:43 42s Dist command failed to produce a tarball: Do not run distmeta. Install Minilla and `minil install` instead.
libmodule-install-autolicense-perl-upstream debianize 2021-04-16T21:51 1m4s Dist command failed to produce a tarball: ['perl', 'Makefile.PL'] failed with unidentified error (return code 2)
libmodule-package-rdf-perl-upstream debianize 2021-05-01T04:07 49s Dist command failed to produce a tarball: ['perl', 'Makefile.PL'] failed with unidentified error (return code 255)
libmojolicious-plugin-bcrypt-perl-upstream debianize 2021-05-01T03:39 1m9s Dist command failed to produce a tarball: ['/usr/bin/dzil', 'build', '--tgz'] failed with unidentified error (return code 255)
libmojolicious-plugin-cgi-perl-upstream debianize 2021-05-01T03:38 37s Dist command failed to produce a tarball: make: *** [Makefile:667: distmeta] Error 2
libmonkey-patch-action-perl-upstream debianize 2021-05-01T03:29 8m57s Dist command failed to produce a tarball: GitHubMeta: no github account name found in URL 'https://github.com/perlancar/perl-Monkey-Patch-Action.git/'
libmoosex-app-perl-upstream debianize 2021-05-04T08:53 1m3s Dist command failed to produce a tarball: ['perl', 'Makefile.PL'] failed with unidentified error (return code 25)
libmoosex-arrayref-perl-upstream debianize 2021-05-04T08:52 54s Dist command failed to produce a tarball: ['/usr/bin/distinkt-dist'] failed with unidentified error (return code 255)
libmoosex-attributeshortcuts-perl-upstream debianize 2021-05-04T11:22 9m38s Dist command failed to produce a tarball: ['/usr/bin/dzil', 'build', '--tgz'] failed with unidentified error (return code 255)
libmoosex-clone-perl-upstream debianize 2021-05-04T08:34 5m4s Dist command failed to produce a tarball: ['/usr/bin/dzil', 'build', '--tgz'] failed with unidentified error (return code 2)
libmoosex-lazyrequire-perl-upstream debianize 2021-05-04T19:25 6m11s Dist command failed to produce a tarball: ['/usr/bin/dzil', 'build', '--tgz'] failed with unidentified error (return code 2)
libmoosex-markasmethods-perl fresh-snapshots 2021-04-16T01:50 13m58s Dist command failed to produce a tarball: ['/usr/bin/dzil', 'build', '--tgz'] failed with unidentified error (return code 128)
libmoosex-meta-typeconstraint-mooish-perl-upstream debianize 2021-05-04T08:15 3m49s Dist command failed to produce a tarball: ['/usr/bin/dzil', 'build', '--tgz'] failed with unidentified error (return code 255)
libmoosex-object-pluggable-perl-upstream debianize 2021-05-04T19:34 6m6s Dist command failed to produce a tarball: ['/usr/bin/dzil', 'build', '--tgz'] failed with unidentified error (return code 2)
libmoosex-semiaffordanceaccessor-perl fresh-snapshots 2021-04-16T05:40 7m9s Dist command failed to produce a tarball: ['/usr/bin/dzil', 'build', '--tgz'] failed with unidentified error (return code 2)
libmoosex-semiaffordanceaccessor-perl-upstream debianize 2021-05-04T08:06 5m38s Dist command failed to produce a tarball: ['/usr/bin/dzil', 'build', '--tgz'] failed with unidentified error (return code 2)
libmoosex-setonce-perl-upstream debianize 2021-04-09T19:05 2m20s Dist command failed to produce a tarball: ['/usr/bin/dzil', 'build', '--tgz'] failed with unidentified error (return code 255)
libmoosex-simpleconfig-perl-upstream debianize 2021-05-04T11:15 5m5s Dist command failed to produce a tarball: ['/usr/bin/dzil', 'build', '--tgz'] failed with unidentified error (return code 2)
libmoosex-traitfor-meta-class-betteranonclassnames-perl-upstream debianize 2021-05-04T19:44 7m55s Dist command failed to produce a tarball: ['/usr/bin/dzil', 'build', '--tgz'] failed with unidentified error (return code 128)
libmoosex-types-stringlike-perl fresh-snapshots 2021-04-09T18:36 5m5s Dist command failed to produce a tarball: ['/usr/bin/dzil', 'build', '--tgz'] failed with unidentified error (return code 255)
libmoosex-types-stringlike-perl-upstream debianize 2021-05-04T07:45 7m30s Dist command failed to produce a tarball: [DZ] no version was ever set
libmoox-aliases-perl-upstream debianize 2021-05-04T07:37 32s Dist command failed to produce a tarball: do "maint/Makefile.PL.include" failed, '.' is no longer in @INC; did you mean do "./maint/Makefile.PL.include"? at Makefile.PL line 50.
libmoox-log-any-perl-upstream debianize 2021-04-13T14:16 1h2m Dist command failed to produce a tarball: ['/usr/bin/dzil', 'build', '--tgz'] failed with unidentified error (return code 128)
libmoox-role-logger-perl-upstream debianize 2021-05-04T07:31 6m0s Dist command failed to produce a tarball: [DZ] no version was ever set
libmoox-traits-perl-upstream debianize 2021-04-23T21:12 6m29s Dist command failed to produce a tarball: ['/usr/bin/distinkt-dist'] failed with unidentified error (return code 2)
libmoox-types-mooselike-numeric-perl-upstream debianize 2021-03-25T20:29 26m25s Dist command failed to produce a tarball: do "maint/Makefile.PL.include" failed, '.' is no longer in @INC; did you mean do "./maint/Makefile.PL.include"? at Makefile.PL line 5.
libmoox-types-mooselike-perl fresh-snapshots 2021-03-27T23:45 9m49s Dist command failed to produce a tarball: do "maint/Makefile.PL.include" failed, '.' is no longer in @INC; did you mean do "./maint/Makefile.PL.include"? at Makefile.PL line 62.
libmoox-types-mooselike-perl-upstream debianize 2021-03-24T00:12 10s Dist command failed: Dist command failed to produce a tarball: do "maint/Makefile.PL.include" failed, '.' is no longer in @INC; did you mean do "./maint/Makefile.PL.include"? at Makefile.PL line 62.
libmoox-types-setobject-perl-upstream debianize 2021-05-04T07:22 33s Dist command failed to produce a tarball: do "maint/Makefile.PL.include" failed, '.' is no longer in @INC; did you mean do "./maint/Makefile.PL.include"? at Makefile.PL line 5.
libmousex-nativetraits-perl-upstream debianize 2021-05-04T07:12 1m13s Dist command failed to produce a tarball: ['perl', 'Makefile.PL'] failed with unidentified error (return code 255)
libmousex-strictconstructor-perl fresh-snapshots 2021-04-16T23:51 1m8s Dist command failed to produce a tarball: ['perl', 'Makefile.PL'] failed with unidentified error (return code 255)
libmousex-strictconstructor-perl-upstream debianize 2021-05-04T07:10 1m27s Dist command failed to produce a tarball: ['perl', 'Makefile.PL'] failed with unidentified error (return code 255)
libmusicbrainz-discid-perl-upstream debianize 2021-03-25T20:11 10s Dist command failed to produce a tarball: Error: pkgconfig is not available on your system
libnet-dhcp-perl-upstream debianize 2021-04-02T01:25 2m10s Dist command failed to produce a tarball: ['/usr/bin/dzil', 'build', '--tgz'] failed with unidentified error (return code 255)
libnet-dns-cloudflare-ddns-perl-upstream debianize 2021-05-04T06:27 12m56s Dist command failed to produce a tarball: ['/usr/bin/dzil', 'build', '--tgz'] failed with unidentified error (return code 255)
libnet-idn-nameprep-perl-upstream debianize 2021-05-04T05:04 2m0s Dist command failed to produce a tarball: ['./Build', 'dist'] failed with unidentified error (return code 2)
libnet-pcap-perl-upstream debianize 2021-05-04T04:19 34s Dist command failed to produce a tarball: ['perl', 'Makefile.PL'] failed with unidentified error (return code 2)
libnet-ssh2-perl-upstream debianize 2021-05-04T04:14 32s Dist command failed to produce a tarball: ['perl', 'Makefile.PL'] failed with unidentified error (return code 2)
libnih fresh-snapshots 2021-04-16T08:13 2m18s Dist command failed to produce a tarball: make[3]: *** No rule to make target '../nih/libnih.la', needed by 'nih-dbus-tool'. Stop.
libnumber-phone-perl-upstream debianize 2021-05-04T04:06 12m56s Dist command failed to produce a tarball: rm: cannot remove 'AllBlocksAugmentedReport.txt': No such file or directory
libobject-pluggable-perl fresh-snapshots 2021-04-16T01:55 4m3s Dist command failed to produce a tarball: ['/usr/bin/dzil', 'build', '--tgz'] failed with unidentified error (return code 255)
libobject-pluggable-perl-upstream debianize 2021-04-09T18:37 2m5s Dist command failed to produce a tarball: ['/usr/bin/dzil', 'build', '--tgz'] failed with unidentified error (return code 255)
libobject-remote-perl-upstream debianize 2021-05-04T03:17 16s Dist command failed to produce a tarball: do "maint/Makefile.PL.include" failed, '.' is no longer in @INC; did you mean do "./maint/Makefile.PL.include"? at Makefile.PL line 5.
libopengl-perl-upstream debianize 2021-05-04T20:55 1m13s Dist command failed to produce a tarball: make: *** [Makefile:24: glversion.txt] Error 1
libpackage-locator-perl-upstream debianize 2021-05-04T02:49 5m49s Dist command failed to produce a tarball: ['/usr/bin/dzil', 'build', '--tgz'] failed with unidentified error (return code 2)
libpam-afs-session fresh-snapshots 2021-03-28T00:27 1m2s Dist command failed to produce a tarball: make[2]: *** No rule to make target 'pam_afs_session.5', needed by 'distdir-am'. Stop.
libparams-util-perl-upstream debianize 2021-05-04T02:26 1m41s Dist command failed to produce a tarball: Capture::Tiny is not installed at /usr/local/share/perl/5.32.1/inc/latest.pm line 91.
libparse-mime-perl-upstream debianize 2021-05-04T11:02 37s Dist command failed to produce a tarball: make: *** [Makefile:931: boilerplate] Error 2
libparse-netstat-perl-upstream debianize 2021-04-09T14:50 14m39s Dist command failed to produce a tarball: GitHubMeta: no github account name found in URL 'https://github.com/perlancar/perl-Parse-Netstat.git/'
libpdb-redo-upstream debianize 2021-05-04T02:10 34s Dist command failed to produce a tarball: configure: error: the required package gsl-dev is not installed
libperinci-cmdline-perl-upstream debianize 2021-04-09T15:36 13m2s Dist command failed to produce a tarball: GitHubMeta: no github account name found in URL 'https://github.com/perlancar/perl-Perinci-CmdLine.git/'
libperinci-object-perl-upstream debianize 2021-05-04T01:59 15m33s Dist command failed to produce a tarball: GitHubMeta: no github account name found in URL 'https://github.com/perlancar/perl-Perinci-Object.git/'
libperinci-sub-normalize-perl-upstream debianize 2021-04-14T06:15 32m17s Dist command failed to produce a tarball: GitHubMeta: no github account name found in URL 'https://github.com/perlancar/perl-Perinci-Sub-Normalize.git/'
libperinci-sub-util-perl-upstream debianize 2021-05-04T01:44 7m26s Dist command failed to produce a tarball: GitHubMeta: no github account name found in URL 'https://github.com/perlancar/perl-Perinci-Sub-Util.git/'
libperinci-sub-util-propertymodule-perl-upstream debianize 2021-04-13T21:51 2h5m Dist command failed to produce a tarball: GitHubMeta: no github account name found in URL 'https://github.com/perlancar/perl-Perinci-Sub-Util-PropertyModule.git/'
libperl-critic-perl-upstream debianize 2021-04-22T06:39 1m11s Dist command failed to produce a tarball: ['./Build', 'dist'] failed with unidentified error (return code 2)
libperl-osnames-perl-upstream debianize 2021-05-04T01:47 15m45s Dist command failed to produce a tarball: GitHubMeta: no github account name found in URL 'https://github.com/perlancar/perl-Perl-osnames.git/'
libperlx-assert-perl-upstream debianize 2021-04-22T06:45 2m7s Dist command failed to produce a tarball: ['/usr/bin/distinkt-dist'] failed with unidentified error (return code 2)
libplack-builder-conditionals-perl-upstream debianize 2021-04-09T14:59 46s Dist command failed to produce a tarball: Do not run distmeta. Install Minilla and `minil install` instead.
libplack-handler-anyevent-fcgi-perl-upstream debianize 2021-04-09T15:00 41s Dist command failed to produce a tarball: ['perl', 'Makefile.PL'] failed with unidentified error (return code 25)
libplack-handler-fcgi-ev-perl-upstream debianize 2021-05-03T16:07 3m7s Dist command failed to produce a tarball: ['perl', 'Makefile.PL'] failed with unidentified error (return code 25)
libplack-middleware-deflater-perl-upstream debianize 2021-05-04T00:09 45s Dist command failed to produce a tarball: ['perl', 'Makefile.PL'] failed with unidentified error (return code 255)
libplack-middleware-expires-perl-upstream debianize 2021-05-04T00:09 1m14s Dist command failed to produce a tarball: Do not run distmeta. Install Minilla and `minil install` instead.
libplack-middleware-file-sass-perl-upstream debianize 2021-04-14T10:52 2m28s Dist command failed to produce a tarball: ['perl', 'Makefile.PL'] failed with unidentified error (return code 2)
libplack-middleware-header-perl-upstream debianize 2021-04-23T16:57 1m57s Dist command failed to produce a tarball: ['perl', 'Makefile.PL'] failed with unidentified error (return code 255)
libplack-middleware-test-stashwarnings-perl-upstream debianize 2021-05-03T23:48 1m2s Dist command failed to produce a tarball: ['perl', 'Makefile.PL'] failed with unidentified error (return code 255)
libplack-request-withencoding-perl-upstream debianize 2021-05-03T23:47 1m2s Dist command failed to produce a tarball: ['minil', 'dist'] failed with unidentified error (return code 0)
libplack-test-anyevent-perl-upstream debianize 2021-05-03T15:51 3m25s dzil authordeps only works on dist.ini files, and you don't have one
libplist fresh-snapshots 2021-04-19T09:47 1m21s Dist command failed to produce a tarball: make[2]: *** [Makefile:547: distdir-am] Error 1
libpll-upstream debianize 2021-05-03T23:33 15h30m Dist command failed to produce a tarball: E: Child terminated by signal ‘Terminated’
libpod-elemental-transformer-list-perl-upstream debianize 2021-04-09T19:33 2m10s Dist command failed to produce a tarball: ['/usr/bin/dzil', 'build', '--tgz'] failed with unidentified error (return code 255)
libpod-markdown-perl-upstream debianize 2021-05-03T15:29 8m53s Dist command failed to produce a tarball: ['/usr/bin/dzil', 'build', '--tgz'] failed with unidentified error (return code 255)
libpod-pom-view-restructured-perl-upstream debianize 2021-05-03T15:33 1m0s Dist command failed to produce a tarball: ['/usr/bin/dzil', 'build', '--tgz'] failed with unidentified error (return code 2)
libpod-readme-perl fresh-snapshots 2021-04-19T11:05 8m18s Dist command failed to produce a tarball: ['/usr/bin/dzil', 'build', '--tgz'] failed with unidentified error (return code 255)
libpod-readme-perl-upstream debianize 2021-04-09T18:35 4m7s Dist command failed to produce a tarball: ['/usr/bin/dzil', 'build', '--tgz'] failed with unidentified error (return code 255)
libpod-spell-perl-upstream debianize 2021-05-03T22:52 8m19s Dist command failed to produce a tarball: ['/usr/bin/dzil', 'build', '--tgz'] failed with unidentified error (return code 2)
libpod-weaver-plugin-ensureuniquesections-perl-upstream debianize 2021-04-14T11:41 53m11s Dist command failed to produce a tarball: ['/usr/bin/dzil', 'build', '--tgz'] failed with unidentified error (return code 2)
libpod-weaver-section-generatesection-perl-upstream debianize 2021-05-03T22:39 2m52s Dist command failed to produce a tarball: ['/usr/bin/dzil', 'build', '--tgz'] failed with unidentified error (return code 2)
libpod-weaver-section-legal-complicated-perl-upstream debianize 2021-05-03T15:29 1m32s Dist command failed to produce a tarball: ['/usr/bin/dzil', 'build', '--tgz'] failed with unidentified error (return code 2)
libpod-wordlist-hanekomu-perl-upstream debianize 2021-05-04T17:12 2m41s Dist command failed to produce a tarball: ['/usr/bin/dzil', 'build', '--tgz'] failed with unidentified error (return code 255)
libpoe-component-sslify-perl-upstream debianize 2021-05-03T22:23 5m10s Dist command failed to produce a tarball: ['/usr/bin/dzil', 'build', '--tgz'] failed with unidentified error (return code 255)
libpoe-component-syndicator-perl-upstream debianize 2021-05-03T22:21 2m31s Dist command failed to produce a tarball: ['/usr/bin/dzil', 'build', '--tgz'] failed with unidentified error (return code 255)
libpoe-test-loops-perl-upstream debianize 2021-05-03T22:02 4m58s Dist command failed to produce a tarball: ['/usr/bin/dzil', 'build', '--tgz'] failed with unidentified error (return code 255)
libpoet-perl-upstream debianize 2021-05-03T22:01 2m1s Dist command failed to produce a tarball: ['/usr/bin/dzil', 'build', '--tgz'] failed with unidentified error (return code 2)
libpostscript-file-perl-upstream debianize 2021-05-03T21:57 2m35s Dist command failed to produce a tarball: [CJM/MatchManifest] Aborted because of MANIFEST mismatch
libproc-background-perl-upstream debianize 2021-05-03T21:53 1m58s Dist command failed to produce a tarball: ['/usr/bin/dzil', 'build', '--tgz'] failed with unidentified error (return code 2)
libproc-daemon-perl-upstream debianize 2021-04-09T18:33 2m35s dzil authordeps only works on dist.ini files, and you don't have one
libproc-fork-perl-upstream debianize 2021-04-14T10:54 2m6s Dist command failed to produce a tarball: make: *** [Makefile:913: boilerplate] Error 2
libproc-guard-perl-upstream debianize 2021-04-14T09:07 2m20s Dist command failed to produce a tarball: Do not run distmeta. Install Minilla and `minil install` instead.
libprogress-any-output-termprogressbarcolor-perl-upstream debianize 2021-05-04T10:43 13m28s Dist command failed to produce a tarball: GitHubMeta: no github account name found in URL 'https://github.com/perlancar/perl-Progress-Any-Output-TermProgressBarColor.git/'
libprogress-any-perl-upstream debianize 2021-04-14T13:18 18m54s Dist command failed to produce a tarball: GitHubMeta: no github account name found in URL 'https://github.com/perlancar/perl-Progress-Any.git/'
libqmi fresh-snapshots 2021-04-04T19:14 2m52s Dist command failed to produce a tarball: libtool: error: cannot find the library '../../../src/libqmi-glib/libqmi-glib.la' or unhandled argument '../../../src/libqmi-glib/libqmi-glib.la'
librdf-acl-perl-upstream debianize 2021-05-03T21:20 1m2s Dist command failed to produce a tarball: ['/usr/bin/distinkt-dist'] failed with unidentified error (return code 255)
librdf-doap-perl-upstream debianize 2021-05-03T21:12 1m29s Dist command failed to produce a tarball: ['/usr/bin/distinkt-dist'] failed with unidentified error (return code 255)
librdf-generator-void-perl-upstream debianize 2021-05-04T10:42 58s Dist command failed to produce a tarball: ['/usr/bin/distinkt-dist'] failed with unidentified error (return code 255)
librdf-icalendar-perl-upstream debianize 2021-05-03T20:47 4m30s Dist command failed to produce a tarball: ['/usr/bin/distinkt-dist'] failed with unidentified error (return code 255)
librdf-linkeddata-perl-upstream debianize 2021-04-23T21:12 7m34s Dist command failed to produce a tarball: ['/usr/bin/distinkt-dist'] failed with unidentified error (return code 255)
librdf-prefixes-perl-upstream debianize 2021-05-03T20:45 58s Dist command failed to produce a tarball: ['/usr/bin/distinkt-dist'] failed with unidentified error (return code 255)
librdf-query-client-perl-upstream debianize 2021-05-03T15:02 2m17s Dist command failed to produce a tarball: ['/usr/bin/distinkt-dist'] failed with unidentified error (return code 2)
librdf-trine-node-literal-xml-perl-upstream debianize 2021-05-03T20:21 2m14s Dist command failed to produce a tarball: ['perl', 'Makefile.PL'] failed with unidentified error (return code 255)
librdf-trine-serializer-rdfa-perl-upstream debianize 2021-05-04T10:42 9m26s Dist command failed to produce a tarball: ['/usr/bin/distinkt-dist'] failed with unidentified error (return code 9)
librdf-trinex-compatibility-attean-perl-upstream debianize 2021-05-03T20:14 2m11s Dist command failed to produce a tarball: ['/usr/bin/distinkt-dist'] failed with unidentified error (return code 255)
librdf-trinex-functions-perl-upstream debianize 2021-05-03T14:58 1m41s Dist command failed to produce a tarball: ['/usr/bin/distinkt-dist'] failed with unidentified error (return code 255)
libredis-fast-perl-upstream debianize 2021-05-03T19:53 1m24s Dist command failed to produce a tarball: ['minil', 'dist'] failed with unidentified error (return code 0)
libref-util-perl fresh-snapshots 2021-03-28T02:14 40m2s Dist command failed to produce a tarball: make: *** [Makefile:587: dist] Error 2
libregexp-pattern-perl-upstream debianize 2021-05-04T10:33 7m36s Dist command failed to produce a tarball: GitHubMeta: no github account name found in URL 'https://github.com/perlancar/perl-Regexp-Pattern.git/'
librinci-perl-upstream debianize 2021-04-23T09:12 8m9s Dist command failed to produce a tarball: GitHubMeta: no github account name found in URL 'https://github.com/perlancar/perl-Rinci.git/'
librole-hasmessage-perl-upstream debianize 2021-04-23T09:11 1m31s Dist command failed to produce a tarball: ['/usr/bin/dzil', 'build', '--tgz'] failed with unidentified error (return code 255)
librole-identifiable-perl-upstream debianize 2021-05-03T19:22 2m38s Dist command failed to produce a tarball: ['/usr/bin/dzil', 'build', '--tgz'] failed with unidentified error (return code 255)
librt-client-rest-perl-upstream debianize 2021-05-03T18:59 21m34s Dist command failed to produce a tarball: ['/usr/bin/dzil', 'build', '--tgz'] failed with unidentified error (return code 2)
libsdl2-image fresh-snapshots 2021-04-22T02:19 1m24s Dist command failed to produce a tarball: make[2]: *** No rule to make target 'IMG_ImageIO.m', needed by 'distdir-am'. Stop.
libsdl-perl-upstream debianize 2021-05-03T14:55 1m33s Dist command failed to produce a tarball: ['perl', 'Build.PL'] failed with unidentified error (return code 2)
libsecrecy-upstream debianize 2021-04-25T00:58 1d8h Dist command failed to produce a tarball: E: PAM error: Authentication failure
libsecret fresh-snapshots 2021-03-27T17:47 1h5m Dist command failed to produce a tarball: FAILED (errors=4)
libseqlib-upstream debianize 2021-05-03T14:54 2m41s Dist command failed to produce a tarball: configure: error: libz not found, please install zlib (http://www.zlib.net/)
libsharyanto-file-util-perl-upstream debianize 2021-04-23T08:38 8m9s Dist command failed to produce a tarball: GitHubMeta: no github account name found in URL 'https://github.com/sharyanto/perl-SHARYANTO-File-Util.git/'
libsndfile fresh-snapshots 2021-03-28T05:50 6m36s Dist command failed to produce a tarball: ['./autogen.sh'] failed with unidentified error (return code 1)
libsoup2.4 fresh-snapshots 2021-03-28T05:31 2m29s Dist command failed to produce a tarball: meson.build:92:0: ERROR: Neither a subproject directory nor a glib.wrap file was found.
libssh2 fresh-snapshots 2021-03-24T14:28 1m35s Dist command failed: Dist command failed to produce a tarball: make[2]: *** [Makefile:1023: win32/libssh2.dsp] Error 2
libstatgen fresh-snapshots 2021-04-24T10:37 3m25s Dist command failed to produce a tarball: make[1]: *** No rule to make target 'dist'. Stop.
libstatgen-upstream debianize 2021-05-03T10:05 47s Dist command failed to produce a tarball: make[1]: *** No rule to make target 'dist'. Stop.
libstatistics-descriptive-perl-upstream debianize 2021-04-23T08:31 52s dzil authordeps only works on dist.ini files, and you don't have one
libstring-elide-parts-perl-upstream debianize 2021-05-04T10:26 13m52s Dist command failed to produce a tarball: GitHubMeta: no github account name found in URL 'https://github.com/perlancar/perl-String-Elide-Parts.git/'
libstring-trim-more-perl-upstream debianize 2021-05-03T08:23 27m30s Dist command failed to produce a tarball: GitHubMeta: no github account name found in URL 'https://github.com/perlancar/perl-String-Trim-More.git/'
libsvn-look-perl-upstream debianize 2021-03-24T11:25 9s Dist command failed: Dist command failed to produce a tarball: Execution of Makefile.PL aborted due to compilation errors.
libsys-cpuload-perl fresh-snapshots 2021-04-16T09:18 7m59s Dist command failed to produce a tarball: ['/usr/bin/dzil', 'build', '--tgz'] failed with unidentified error (return code 255)
libsys-hostip-perl-upstream debianize 2021-04-06T14:28 3m11s dzil authordeps only works on dist.ini files, and you don't have one
libsys-info-driver-linux-perl-upstream debianize 2021-05-01T01:28 2d18h Dist command failed to produce a tarball: ['/usr/bin/dzil', 'build', '--tgz'] failed with unidentified error (return code 1)
libsys-virt-perl fresh-snapshots 2021-04-22T00:59 1m58s Dist command failed to produce a tarball: libvirt >= 7.3.0 is required
libtelephony-asterisk-ami-perl-upstream debianize 2021-04-23T08:08 2m22s dzil authordeps only works on dist.ini files, and you don't have one
libtest-checkmanifest-perl-upstream debianize 2021-04-23T08:04 3m22s dzil authordeps only works on dist.ini files, and you don't have one
libtest-dbic-expectedqueries-perl-upstream debianize 2021-04-23T08:02 48s dzil authordeps only works on dist.ini files, and you don't have one
libtest-failwarnings-perl-upstream debianize 2021-04-23T08:01 3m37s Dist command failed to produce a tarball: [DZ] no version was ever set
libtest-filename-perl-upstream debianize 2021-04-23T07:59 3m36s Dist command failed to produce a tarball: [DZ] no version was ever set
libtest-log-log4perl-perl-upstream debianize 2021-03-23T19:30 2m46s Dist command failed: Dist command failed to produce a tarball: make: *** [Makefile:534: Test-Log-Log4perl-0.32.tar.gz] Error 1
libtest-mockrandom-perl-upstream debianize 2021-04-23T07:56 3m26s Dist command failed to produce a tarball: [DZ] no version was ever set
libtest-modern-perl-upstream debianize 2021-04-14T00:14 51m39s Dist command failed to produce a tarball: Failed tests: 1-4
libtest-name-fromline-perl-upstream debianize 2021-05-04T10:15 29s Dist command failed to produce a tarball: Do not run distmeta. Install Minilla and `minil install` instead.
libtest-pod-no404s-perl-upstream debianize 2021-04-23T07:51 2m46s Dist command failed to produce a tarball: ['/usr/bin/dzil', 'build', '--tgz'] failed with unidentified error (return code 255)
libtest-randomresult-perl-upstream debianize 2021-05-03T10:24 14m56s Dist command failed to produce a tarball: GitHubMeta: no github account name found in URL 'https://github.com/perlancar/perl-Test-RandomResult.git/'
libtest-rdf-doap-version-perl-upstream debianize 2021-04-23T07:51 1m19s Dist command failed to produce a tarball: ['/usr/bin/distinkt-dist'] failed with unidentified error (return code 2)
libtest-regexp-pattern-perl-upstream debianize 2021-04-23T07:51 9m0s Dist command failed to produce a tarball: GitHubMeta: no github account name found in URL 'https://github.com/perlancar/perl-Test-Regexp-Pattern.git/'
libtext-vcard-perl-upstream debianize 2021-05-03T09:55 5m16s dzil authordeps only works on dist.ini files, and you don't have one
libtext-wrapper-perl-upstream debianize 2021-05-04T21:14 5m26s Dist command failed to produce a tarball: [CJM/MatchManifest] Aborted because of MANIFEST mismatch
libtie-cphash-perl-upstream debianize 2021-04-14T02:28 48m55s Dist command failed to produce a tarball: [CJM/MatchManifest] Aborted because of MANIFEST mismatch
libtime-moment-perl-upstream debianize 2021-04-14T11:30 3m1s Dist command failed to produce a tarball: ['perl', 'Makefile.PL'] failed with unidentified error (return code 1)
libunicode-utf8-perl-upstream debianize 2021-03-23T20:17 12s Dist command failed: Dist command failed to produce a tarball: command ['perl', 'Makefile.PL'] failed with unidentified error (return code 1)
liburi-namespacemap-perl-upstream debianize 2021-05-03T09:51 9m49s Dist command failed to produce a tarball: ['/usr/bin/distinkt-dist'] failed with unidentified error (return code 9)
liburl-encode-perl-upstream debianize 2021-04-16T22:59 43s Dist command failed to produce a tarball: String found where operator expected at Makefile.PL line 8, near "readme_from 'lib/URL/Encode.pod'"
libusbmuxd fresh-snapshots 2021-03-28T06:01 33s Dist command failed to produce a tarball: make[2]: *** [Makefile:523: distdir-am] Error 1
libuser fresh-snapshots 2021-03-28T02:59 2m14s Dist command failed to produce a tarball: cp: cannot stat './lib/getdate.c': No such file or directory
libversion-compare-perl-upstream debianize 2021-04-09T15:29 1m45s Dist command failed to produce a tarball: ['/usr/bin/dzil', 'build', '--tgz'] failed with unidentified error (return code 255)
libversion-perl-upstream debianize 2021-04-22T06:57 1m15s Dist command failed to produce a tarball: make: *** [Makefile:696: version-0.9913_01.tar.gz] Error 255
libweb-id-perl-upstream debianize 2021-04-13T22:31 1h41m Dist command failed to produce a tarball: ['/usr/bin/distinkt-dist'] failed with unidentified error (return code 255)
libweb-simple-perl-upstream debianize 2021-05-03T09:15 12s Dist command failed to produce a tarball: do "maint/Makefile.PL.include" failed, '.' is no longer in @INC; did you mean do "./maint/Makefile.PL.include"? at Makefile.PL line 6.
libwfut-upstream debianize 2021-05-15T01:11 1d15h Dist command failed to produce a tarball: E: PAM error: Authentication failure
libwmf fresh-snapshots 2021-03-28T04:56 33m37s Dist command failed to produce a tarball: configure: error: * * * freetype(2) is required * * *
libwww-curl-perl fresh-snapshots 2021-04-24T06:31 1m43s Dist command failed to produce a tarball: ['perl', 'Makefile.PL'] failed with unidentified error (return code 2)
libwww-finger-perl-upstream debianize 2021-03-23T19:41 18m10s Dist command failed: Dist command failed to produce a tarball: command ['perl', 'Makefile.PL'] failed with unidentified error (return code 255)
libwww-mechanize-shell-perl-upstream debianize 2021-04-14T13:37 1m6s Dist command failed to produce a tarball: Makefile:296: *** target pattern contains no '%'. Stop.
libxml2 fresh-snapshots 2021-03-24T14:15 21m26s Dist command failed: Dist command failed to produce a tarball: make[4]: *** No rule to make target 'libxml2.py', needed by 'distdir-am'. Stop.
libxml-libxml-debugging-perl-upstream debianize 2021-05-03T08:52 1m43s Dist command failed to produce a tarball: ['/usr/bin/distinkt-dist'] failed with unidentified error (return code 255)
libxml-rss-libxml-perl-upstream debianize 2021-05-03T08:26 4m35s Dist command failed to produce a tarball: Do not run distmeta. Install Minilla and `minil install` instead.
libyaml-syck-perl-upstream debianize 2021-04-30T15:52 4m45s cpanfile: No such file or directory at /usr/share/perl5/Module/CPANfile.pm line 47.
libzapojit fresh-snapshots 2021-03-27T17:07 52m8s Dist command failed to produce a tarball: libtool: error: cannot find the library '../../src/libzapojit-0.0.la' or unhandled argument '../../src/libzapojit-0.0.la'
libzeep-upstream debianize 2021-04-14T10:18 2m6s Dist command failed to produce a tarball: configure: error: Sorry, your boost is not found or not up-to-date.
libzmq-ffi-perl-upstream debianize 2021-04-09T18:37 6m55s Dist command failed to produce a tarball: ['/usr/bin/dzil', 'build', '--tgz'] failed with unidentified error (return code 255)
link-grammar fresh-snapshots 2021-04-16T11:56 21m25s Dist command failed to produce a tarball: make[4]: *** No rule to make target 'link-grammar.def', needed by 'distdir-am'. Stop.
lua-lgi fresh-snapshots 2021-04-23T23:32 9m57s Dist command failed to produce a tarball: ninja: build stopped: subcommand failed.
m17n-db fresh-snapshots 2021-04-24T06:46 2m29s Dist command failed to produce a tarball: make[3]: *** No rule to make target 'distdir'. Stop.
mame fresh-snapshots 2021-03-29T01:35 7h42m Dist command failed to produce a tarball: ['make', 'dist'] failed with unidentified error (return code 2)
mangohud-upstream debianize 2021-05-03T08:22 2m51s Dist command failed to produce a tarball: src/meson.build:1:0: ERROR: Program 'glslangValidator' not found
mapdamage-upstream debianize 2021-04-30T20:00 9m6s FileNotFoundError: [Errno 2] No such file or directory: 'README.md'
mapserver-upstream debianize 2021-04-14T17:40 6m58s Dist command failed to produce a tarball: configure: error: unable to link - reconfigure with correct --with-freetype=dir
mash fresh-snapshots 2021-04-16T04:55 1m50s Dist command failed to produce a tarball: configure: error: Cap'n Proto compiler (capnp) not found.
mathicgb fresh-snapshots 2021-03-28T02:02 11m0s Dist command failed to produce a tarball: make[2]: *** No rule to make target 'src/mathicgb/FixedSizeMonomialMap.hpp', needed by 'distdir-am'. Stop.
mayavi2-upstream debianize 2021-04-30T19:01 6m33s RuntimeError:
medicalterms-upstream debianize 2021-05-03T08:21 13s Dist command failed to produce a tarball: configure: error: aspell is required for building this package.
memtailor fresh-snapshots 2021-03-28T00:05 7m33s Dist command failed to produce a tarball: ['./configure'] failed with unidentified error (return code 1)
memtailor-upstream debianize 2021-05-03T08:16 5m1s Dist command failed to produce a tarball: ['./configure'] failed with unidentified error (return code 1)
mercator-upstream debianize 2021-05-03T08:08 1m22s Dist command failed to produce a tarball: configure: error:
mess-desktop-entries fresh-snapshots 2021-04-19T11:13 1m22s Dist command failed to produce a tarball: configure: error:
mhwaveedit-upstream debianize 2021-03-24T20:19 3m52s Dist command failed: Dist command failed to produce a tarball: Makefile.am: error: required file './README' not found
mixxx fresh-snapshots 2021-04-24T10:03 27m44s Dist command failed to produce a tarball: KeyError: 'build-system'
montage-wrapper-upstream debianize 2021-05-03T08:10 1m16s Dist command failed to produce a tarball: AttributeError: 'str' object has no attribute 'decode'
mousepad fresh-snapshots 2021-04-22T02:50 2m35s Dist command failed to produce a tarball: cp: cannot stat './ChangeLog': No such file or directory
mplcursors-upstream debianize 2021-05-03T08:07 3m29s OSError: could not get source code
mpmath-upstream debianize 2021-03-24T19:17 16m4s AssertionError: Can't parse version upstream/1.2.1+git20210304.1bb25a4
mptp-upstream debianize 2021-05-04T09:43 31s Dist command failed to produce a tarball: configure: error: could not find required installation of FLEX
mrc-upstream debianize 2021-04-14T15:50 59s Dist command failed to produce a tarball: configure: error: Could not link against boost_program_options-boost_program_options !
mugshot-upstream debianize 2021-05-03T07:51 3m48s Dist command failed to produce a tarball: To build mugshot you need https://launchpad.net/python-distutils-extra
mummer-upstream debianize 2021-03-24T19:11 3m24s Dist command failed: Dist command failed to produce a tarball: make[1]: *** [Makefile:2928: src/umd/nucmer_cmdline.hpp] Error 1
nautilus-dropbox fresh-snapshots 2021-04-16T11:37 1m16s Dist command failed to produce a tarball: You need to install gnome-common
ncbi-vdb fresh-snapshots 2021-03-28T05:32 57m59s Dist command failed to produce a tarball: /build/tmp76sjc22d/ncbi-vdb/build/Makefile.shell:27: *** "*** File '/build/tmp76sjc22d/ncbi-vdb/build/Makefile.config' is missing. Please run /build/tmp76sjc22d/ncbi-vdb/build/configure". Stop.
ncbi-vdb-upstream debianize 2021-05-03T07:19 3m44s Dist command failed to produce a tarball: /build/tmpahyy4h68/package/build/Makefile.shell:27: *** "*** File '/build/tmpahyy4h68/package/build/Makefile.config' is missing. Please run /build/tmpahyy4h68/package/build/configure". Stop.
netbeans fresh-snapshots 2021-05-11T22:39 24m10s Dist command failed to produce a tarball: ['apt', '-y', 'satisfy', 'debhelper-compat (= 13),\n default-jdk,\n javahelper,\n maven-repo-helper'] failed with unidentified error (return code 100)
netcdf-cxx-upstream debianize 2021-03-23T19:59 3m51s Dist command failed: Dist command failed to produce a tarball: configure: error: netcdf.h could not be found. Please set CPPFLAGS.
netcdf-fortran-upstream debianize 2021-05-04T09:39 12s Dist command failed to produce a tarball: configure: error: in `/build/tmpm3ka_e3a/package':
netcdf-upstream debianize 2021-05-03T07:18 4m55s Dist command failed to produce a tarball: configure: error: Can't find or link to the z library. Turn off netCDF-4 and opendap with --disable-netcdf-4 --disable-dap, or see config.log for errors.
network-manager-l2tp fresh-snapshots 2021-04-19T10:49 2m14s Dist command failed to produce a tarball: *** error: gettext infrastructure mismatch: using a Makefile.in.in from gettext version 0.19 but the autoconf macros are from gettext version 0.20
ngircd fresh-snapshots 2021-04-16T10:15 1m37s Dist command failed to produce a tarball: configure.ac:32: error: version mismatch. This is Automake 1.16.3,
nipy-upstream debianize 2021-04-30T19:02 6m21s RuntimeError: 'distutils.core.setup()' was never called -- perhaps 'setup.py' is not a Distutils setup script?
nitime-upstream debianize 2021-04-25T15:07 49s Dist command failed to produce a tarball: NameError: name 'execfile' is not defined
node-arg-upstream debianize 2021-04-14T10:05 47s Dist command failed to produce a tarball: E: Failed to execute “apt”: No such file or directory
node-autoprefixer fresh-snapshots 2021-03-26T17:50 28s Dist command failed to produce a tarball: E: Problem parsing dependency: debhelper-compat (= 13)
node-browser-stdout fresh-snapshots 2021-04-16T09:35 32s Dist command failed to produce a tarball: E: Problem parsing dependency: debhelper (>= 12~),
node-chai fresh-snapshots 2021-04-26T22:16 15s Dist command failed to produce a tarball: E: Child terminated by signal ‘Terminated’
node-cli-cursor fresh-snapshots 2021-04-26T22:16 1m58s Dist command failed to produce a tarball: E: Child terminated by signal ‘Terminated’
node-cliui fresh-snapshots 2021-04-09T07:41 1m54s Dist command failed to produce a tarball: npm ERR! lib/index.ts(354,12): error TS2580: Cannot find name 'process'. Do you need to install type definitions for node? Try `npm i --save-dev @types/node`.
node-cliui-upstream debianize 2021-03-23T20:01 15m7s Dist command failed: Dist command failed to produce a tarball: npm ERR! lib/index.ts(354,12): error TS2580: Cannot find name 'process'. Do you need to install type definitions for node? Try `npm i --save-dev @types/node`.
node-coffee-loader-upstream debianize 2021-05-02T02:57 1m15s Dist command failed to produce a tarball: npm ERR! code 1
node-copy-webpack-plugin fresh-snapshots 2021-04-24T09:13 18s Dist command failed to produce a tarball: E: Problem parsing dependency: debhelper-compat (= 13),
node-css-what fresh-snapshots 2021-04-08T20:13 2m7s Dist command failed to produce a tarball: npm ERR! src/stringify.ts(13,27): error TS2583: Cannot find name 'Set'. Do you need to change your target library? Try changing the `lib` compiler option to 'es2015' or later.
node-css-what-upstream debianize 2021-05-02T00:09 1m54s Dist command failed to produce a tarball: npm ERR! src/stringify.ts(13,27): error TS2583: Cannot find name 'Set'. Do you need to change your target library? Try changing the `lib` compiler option to 'es2015' or later.
node-debug-fabulous fresh-snapshots 2021-04-24T06:06 7m49s Dist command failed to produce a tarball: npm ERR! ERROR: [Errno 2] No such file or directory: 'postinstall:1'
node-debug-fabulous-upstream debianize 2021-04-23T05:56 3m28s Dist command failed to produce a tarball: npm ERR! ERROR: [Errno 2] No such file or directory: 'postinstall:1'
node-domhandler fresh-snapshots 2021-04-08T20:14 2m8s Dist command failed to produce a tarball: npm ERR! src/node.ts(297,5): error TS2322: Type 'NodeWithChildren | Text | Comment | ProcessingInstruction | undefined' is not assignable to type 'Node'.
node-domhandler-upstream debianize 2021-04-23T05:45 5m1s Dist command failed to produce a tarball: npm ERR! src/node.ts(3,23): error TS2583: Cannot find name 'Map'. Do you need to change your target library? Try changing the `lib` compiler option to 'es2015' or later.
node-dom-serializer fresh-snapshots 2021-04-09T12:03 2m10s Dist command failed to produce a tarball: npm ERR! src/index.ts(173,29): error TS2583: Cannot find name 'Set'. Do you need to change your target library? Try changing the `lib` compiler option to 'es2015' or later.
node-dom-serializer-upstream debianize 2021-03-23T20:18 59m13s Dist command failed: Dist command failed to produce a tarball: npm ERR! src/index.ts(146,29): error TS2583: Cannot find name 'Set'. Do you need to change your target library? Try changing the `lib` compiler option to 'es2015' or later.
node-entities fresh-snapshots 2021-03-23T18:55 6m56s Dist command failed: Dist command failed to produce a tarball: npm ERR! src/encode.ts(97,40): error TS2550: Property 'codePointAt' does not exist on type 'string'. Do you need to change your target library? Try changing the `lib` compiler option to 'es2015' or later.
node-entities-upstream debianize 2021-05-01T18:08 1m50s Dist command failed to produce a tarball: npm ERR! src/encode.ts(97,40): error TS2550: Property 'codePointAt' does not exist on type 'string'. Do you need to change your target library? Try changing the `lib` compiler option to 'es2015' or later.
node-err-code fresh-snapshots 2021-04-16T05:10 19s Dist command failed to produce a tarball: E: Problem parsing dependency: debhelper-compat (= 13),
node-exports-loader fresh-snapshots 2021-04-16T08:30 2m21s Dist command failed to produce a tarball: npm ERR! code 1
node-exports-loader-upstream debianize 2021-04-23T05:20 4m52s Dist command failed to produce a tarball: npm ERR! code 1
node-fetch-upstream debianize 2021-04-30T19:33 13m20s Dist command failed to produce a tarball: npm ERR! code 1
node-file-loader-upstream debianize 2021-05-03T02:01 5m56s Dist command failed to produce a tarball: npm ERR! code 1
node-get-caller-file-upstream debianize 2021-03-23T20:25 1h10m Dist command failed: Dist command failed to produce a tarball: npm ERR! test.ts(37,38): error TS2339: Property 'stackTraceLimit' does not exist on type 'ErrorConstructor'.
node-got-upstream debianize 2021-05-04T08:11 2m21s Dist command failed to produce a tarball: npm ERR! test/weakable-map.ts(1,18): error TS2792: Cannot find module 'ava'. Did you mean to set the 'moduleResolution' option to 'node', or to add aliases to the 'paths' option?
node-grunt-contrib-nodeunit fresh-snapshots 2021-04-06T05:37 7s Dist command failed to produce a tarball: E: Problem parsing dependency: debhelper-compat (= 13),
node-grunt-legacy-util fresh-snapshots 2021-04-07T01:20 13s Dist command failed to produce a tarball: E: Problem parsing dependency: debhelper-compat (= 12),
node-imports-loader fresh-snapshots 2021-04-16T05:36 4m1s Dist command failed to produce a tarball: npm ERR! code 1
node-imports-loader-upstream debianize 2021-05-04T07:20 3m2s Dist command failed to produce a tarball: npm ERR! code 1
node-jsdom-upstream debianize 2021-04-24T23:10 13m16s Dist command failed to produce a tarball: npm ERR! ERROR: [Errno 2] No such file or directory: 'convert-idl'
node-less-loader-upstream debianize 2021-04-24T22:52 2m24s Dist command failed to produce a tarball: npm ERR! code 1
node-mem-upstream debianize 2021-05-04T03:14 2m9s Dist command failed to produce a tarball: test.ts(272,14): error TS2583: Cannot find name 'WeakMap'. Do you need to change your target library? Try changing the `lib` compiler option to 'es2015' or later.
node-mini-css-extract-plugin-upstream debianize 2021-04-24T22:31 2m31s Dist command failed to produce a tarball: npm ERR! code 1
node-nth-check-upstream debianize 2021-05-02T17:44 1m9s Dist command failed to produce a tarball: npm ERR! src/parse.ts(33,27): error TS2550: Property 'startsWith' does not exist on type 'string'. Do you need to change your target library? Try changing the `lib` compiler option to 'es2015' or later.
node-rai fresh-snapshots 2021-04-06T15:00 17s Dist command failed to produce a tarball: E: Problem parsing dependency: debhelper-compat (= 12),
node-ramda-upstream debianize 2021-05-03T23:41 1m34s Dist command failed to produce a tarball: npm ERR! code 1
node-raw-loader-upstream debianize 2021-04-24T21:20 3m50s Dist command failed to produce a tarball: npm ERR! code 1
node-sntp fresh-snapshots 2021-04-07T17:53 18s Dist command failed to produce a tarball: E: Problem parsing dependency: debhelper-compat (= 13)
node-socket.io-parser-upstream debianize 2021-05-03T20:54 1m20s Dist command failed to produce a tarball: lib/index.ts(284,26): error TS2580: Cannot find name 'Buffer'. Do you need to install type definitions for node? Try `npm i --save-dev @types/node`.
node-style-loader fresh-snapshots 2021-04-09T18:59 3m59s Dist command failed to produce a tarball: npm ERR! code 1
node-tildify fresh-snapshots 2021-04-27T02:08 17s Dist command failed to produce a tarball: E: Problem parsing dependency: debhelper-compat (= 13),
node-uglifyjs-webpack-plugin-upstream debianize 2021-05-01T07:42 2m11s Dist command failed to produce a tarball: npm ERR! code 1
node-url-loader fresh-snapshots 2021-04-09T18:55 2m35s Dist command failed to produce a tarball: npm ERR! code 1
node-url-loader-upstream debianize 2021-05-01T07:40 2m23s Dist command failed to produce a tarball: npm ERR! code 1
node-vinyl-fs fresh-snapshots 2021-04-22T02:58 10s Dist command failed to produce a tarball: E: Problem parsing dependency: debhelper-compat (= 13),
node-xterm fresh-snapshots 2021-04-27T03:32 2m3s Dist command failed to produce a tarball: npm ERR! code 1
node-xterm-upstream debianize 2021-05-01T07:27 3m26s Dist command failed to produce a tarball: npm ERR! code 1
node-yargs fresh-snapshots 2021-04-24T01:58 12m59s Dist command failed to produce a tarball: npm ERR! lib/yerror.ts(5,11): error TS2339: Property 'captureStackTrace' does not exist on type 'ErrorConstructor'.
node-yargs-parser fresh-snapshots 2021-04-05T09:34 2m2s Dist command failed to produce a tarball: npm ERR! lib/index.ts(36,14): error TS2580: Cannot find name 'require'. Do you need to install type definitions for node? Try `npm i --save-dev @types/node`.
node-yargs-parser-upstream debianize 2021-03-23T19:23 6m24s Dist command failed: Dist command failed to produce a tarball: npm ERR! lib/index.ts(36,14): error TS2580: Cannot find name 'require'. Do you need to install type definitions for node? Try `npm i --save-dev @types/node`.
node-yargs-upstream debianize 2021-04-30T18:58 2m4s Dist command failed to produce a tarball: npm ERR! lib/yerror.ts(5,11): error TS2339: Property 'captureStackTrace' does not exist on type 'ErrorConstructor'.
numexpr-upstream debianize 2021-05-01T07:22 2m0s FileNotFoundError: [Errno 2] No such file or directory: 'doc/__version__.py'
ocfs2-tools fresh-snapshots 2021-04-06T18:45 40s Dist command failed to produce a tarball: ['make', 'dist'] failed with unidentified error (return code 2)
ocsinventory-agent-upstream debianize 2021-05-01T07:19 2m2s cpanfile: No such file or directory at /usr/share/perl5/Module/CPANfile.pm line 47.
opendmarc fresh-snapshots 2021-04-23T22:11 3m0s Dist command failed to produce a tarball: configure.ac:514: error: required file 'docs/Makefile.in' not found
openrc fresh-snapshots 2021-04-24T10:03 4m25s Dist command failed to produce a tarball: make: *** [/build/tmpqjnuq2qb/openrc//mk/dist.mk:30: dist] Error 128
openscad fresh-snapshots 2021-04-27T01:44 4m25s Dist command failed to produce a tarball: cp: cannot stat 'openscad_interface.h': No such file or directory
openyahtzee fresh-snapshots 2021-04-22T03:51 1m50s Dist command failed to produce a tarball: ['autoreconf', '-i'] failed with unidentified error (return code 1)
ostinato fresh-snapshots 2021-04-04T23:34 1m9s Dist command failed to produce a tarball: cp: cannot stat 'version.cpp': No such file or directory
owfs fresh-snapshots 2021-04-27T01:33 1m59s Dist command failed to produce a tarball: Makefile.am: error: required file './README' not found
pandas-upstream debianize 2021-03-24T12:15 1h2m Broken apt packages: Depends: python3-numpy (= 1.17.3) but 1:1.19.5-1 is to be installed
parallel fresh-snapshots 2021-03-23T19:00 13m3s Dist command failed: Dist command failed to produce a tarball: configure.ac:2: error: version mismatch. This is Automake 1.16.3,
parasail-upstream debianize 2021-03-23T19:30 6m57s Dist command failed: Dist command failed to produce a tarball: ../dist-unpack/parasail-2.0.4/apps/parasail_aligner.cpp:2835:14: error: ‘ILL_COPROC’ was not declared in this scope
parsnp-upstream debianize 2021-03-23T19:19 28s Dist command failed: Dist command failed to produce a tarball: configure: error: cannot find install-sh, install.sh, or shtool in "." "./.." "./../.."
pbcopper fresh-snapshots 2021-04-24T00:11 10m15s Dist command failed to produce a tarball: /usr/include/boost/optional/optional.hpp:1596:3: error: static assertion failed: If you want to output boost::optional, include header <boost/optional/optional_io.hpp>
pcb fresh-snapshots 2021-04-22T03:46 4m27s Dist command failed to produce a tarball: configure: error: You have requested a build
pcs fresh-snapshots 2021-04-24T14:34 7m25s Dist command failed to produce a tarball: KeyError: 'build-system'
pdfposter fresh-snapshots 2021-03-28T03:02 16m9s Dist command failed to produce a tarball: SyntaxError: invalid syntax
pd-iemmatrix-upstream debianize 2021-05-01T07:07 42s Dist command failed to produce a tarball: configure: error: m_pd.h is desperately needed!
pd-libdir-upstream debianize 2021-03-23T19:20 11s
peewee-upstream debianize 2021-05-02T16:38 1m30s Dist command failed to produce a tarball: Exception: Building sdist requires that Cython be installed.
pekwm fresh-snapshots 2021-04-27T05:11 56s Dist command failed to produce a tarball: Makefile:3: mk/config.mk: No such file or directory
perl6-readline fresh-snapshots 2021-04-19T11:09 5m41s Dist command failed to produce a tarball: [DZ] no name was ever set
perlbrew-upstream debianize 2021-05-01T07:07 1m29s No such action 'distmeta'
pev fresh-snapshots 2021-04-27T03:05 50s Dist command failed to produce a tarball: make[1]: *** No rule to make target 'dist'. Stop.
phodav fresh-snapshots 2021-03-27T00:01 27m48s Dist command failed to produce a tarball: data/meson.build:19:0: ERROR: String 'UNKNOWN' cannot be converted to int
php-geos-upstream debianize 2021-03-23T19:40 2m57s Dist command failed: Dist command failed to produce a tarball: Error: Invalid tag order in <lead>, found <email> expected one of "user"
phyml fresh-snapshots 2021-04-24T00:45 8m45s Dist command failed to produce a tarball: make[2]: *** No rule to make target 'bin', needed by 'distdir-am'. Stop.
phyml-upstream debianize 2021-03-23T20:17 4m22s Dist command failed: Dist command failed to produce a tarball: make[2]: *** No rule to make target 'bin', needed by 'distdir-am'. Stop.
pipexec fresh-snapshots 2021-03-28T03:03 7m1s Dist command failed to produce a tarball: configure.ac:3: error: AC_INIT should be called with package and version arguments
playerctl-upstream debianize 2021-05-01T06:51 55s Dist command failed to produce a tarball: playerctl/meson.build:98:6: ERROR: Problem encountered: You need to have gobject-introspection installed to generate Gir data. Disable it with `-Dintrospection=false` if you don't want to build it
pocketsphinx fresh-snapshots 2021-04-22T03:43 5m39s Dist command failed to produce a tarball: configure: error: in `/build/tmptbmhrevy/pocketsphinx':
pocketsphinx-upstream debianize 2021-05-01T06:49 2m45s Dist command failed to produce a tarball: ['./autogen.sh'] failed with unidentified error (return code 1)
porechop-upstream debianize 2021-05-02T16:30 7m30s urllib.error.HTTPError: HTTP Error 403: SSL is required
poretools-upstream debianize 2021-05-01T06:42 59s Dist command failed to produce a tarball: SyntaxError: Missing parentheses in call to 'print'. Did you mean print(version)?
pplpy-upstream debianize 2021-03-23T20:31 31m46s Broken apt packages: command line argument : Depends: python3-gmpy2 (>= 2.1.0b1) but it is not going to be installed
praat-upstream debianize 2021-05-01T06:33 4m41s Dist command failed to produce a tarball: Makefile:11: makefile.defs: No such file or directory
proteinortho fresh-snapshots 2021-04-14T02:31 7h43m Dist command failed to produce a tarball: ['apt', '-y', 'satisfy', 'debhelper-compat (= 13),\n ncbi-blast+,\n liblapack-dev | libatlas-base-dev | liblapack.so,\n diamond-aligner,\n procps'] failed with unidentified error (return code 1)
pspp fresh-snapshots 2021-04-24T04:51 11m22s Dist command failed to produce a tarball: aclocal: error: couldn't open directory 'gl/m4': No such file or directory
pspp-upstream debianize 2021-03-23T17:30 5m48s Dist command failed: Dist command failed to produce a tarball: aclocal: error: couldn't open directory 'gl/m4': No such file or directory
pybtex fresh-snapshots 2021-04-24T01:43 6m55s Dist command failed to produce a tarball: ['python', './setup.py', 'sdist'] failed with unidentified error (return code 1)
pylibtiff-upstream debianize 2021-04-30T16:54 5m47s RuntimeError: 'distutils.core.setup()' was never called -- perhaps 'setup.py' is not a Distutils setup script?
pypass-upstream debianize 2021-04-23T12:21 58s Dist command failed to produce a tarball: Exception: Versioning for this project requires either an sdist tarball, or access to an upstream git repository. It's also possible that there is a mismatch between the package name in setup.cfg and the argument given to pbr.version.VersionInfo. Project name pypass was given, but was not able to be found.
pyppd fresh-snapshots 2021-03-26T17:01 6m48s Dist command failed to produce a tarball: error: [Errno 2] No such file or directory: 'git'
pyqi fresh-snapshots 2021-04-24T03:13 2m25s Dist command failed to produce a tarball: Only Python 2.7, 3.3, and 3.4 are supported.
pyroute2-upstream debianize 2021-03-23T20:13 2m38s Dist command failed: Dist command failed to produce a tarball: FileNotFoundError: [Errno 2] No such file or directory: 'README.md'
pyspf-upstream debianize 2021-04-30T18:12 5m1s FileNotFoundError: [Errno 2] No such file or directory: 'README.md'
pysph-upstream debianize 2021-03-23T19:43 14m8s Dist command failed: [ 1/19] Cythonizing pysph/base/box_sort_nnps.pyx
python-biopython-upstream debianize 2021-04-30T19:44 17m42s RuntimeError: 'distutils.core.setup()' was never called -- perhaps 'setup.py' is not a Distutils setup script?
python-bitbucket-api-upstream debianize 2021-04-23T13:12 2m40s FileNotFoundError: [Errno 2] No such file or directory: 'README'
python-cassandra-driver-upstream debianize 2021-04-23T12:57 5m5s IndexError: list index out of range
python-debtcollector fresh-snapshots 2021-04-06T22:15 54s Dist command failed to produce a tarball: Exception: Versioning for this project requires either an sdist tarball, or access to an upstream git repository. It's also possible that there is a mismatch between the package name in setup.cfg and the argument given to pbr.version.VersionInfo. Project name debtcollector was given, but was not able to be found.
python-demgengeo fresh-snapshots 2021-04-24T08:48 4m13s Dist command failed to produce a tarball: configure: error: MPI library not found...please install MPI
python-diaspy-upstream debianize 2021-05-02T15:55 31s Dist command failed to produce a tarball: SyntaxError: invalid syntax
python-drizzle-upstream debianize 2021-03-24T18:57 14m42s subprocess.CalledProcessError: Command '['/usr/bin/python', '-m', 'pip', '--disable-pip-version-check', 'wheel', '--no-deps', '-w', '/tmp/tmpi2ji6cm6', '--quiet', 'setuptools_scm']' returned non-zero exit status 1.
python-dugong-upstream debianize 2021-05-01T05:53 1m28s RuntimeError: 'distutils.core.setup()' was never called -- perhaps 'setup.py' is not a Distutils setup script?
python-feather-format-upstream debianize 2021-04-03T13:31 1m48s FileNotFoundError: [Errno 2] No such file or directory: 'setup.py'
python-hashids-upstream debianize 2021-04-14T09:58 9m14s Dist command failed to produce a tarball: E: Failed to execute “apt”: No such file or directory
python-hdf4-upstream debianize 2021-04-22T06:35 2m25s FileNotFoundError: [Errno 2] No such file or directory: 'setup.py'
python-httplib2-upstream debianize 2021-03-25T16:59 4m0s E: Failed to execute “python3”: Permission denied
python-igor-upstream debianize 2021-05-02T14:40 40s Dist command failed to produce a tarball: mv: cannot stat './docs/latex/refman.pdf': No such file or directory
python-igraph fresh-snapshots 2021-04-13T01:31 1h1m Dist command failed to produce a tarball: RuntimeError: You need to build the C core of igraph first before generating a source tarball of python-igraph
python-igraph-upstream debianize 2021-04-14T13:34 6m16s Dist command failed to produce a tarball: RuntimeError: You need to build the C core of igraph first before generating a source tarball of python-igraph
python-injector-upstream debianize 2021-03-25T16:27 7m4s FileNotFoundError: [Errno 2] No such file or directory: 'requirements.txt'
python-libusb1 fresh-snapshots 2021-04-07T23:30 3m1s Dist command failed to produce a tarball: Use setup.sh to build
python-llfuse-upstream debianize 2021-05-04T21:11 1m16s RuntimeError: 'distutils.core.setup()' was never called -- perhaps 'setup.py' is not a Distutils setup script?
python-mapnik-upstream debianize 2021-05-04T20:39 35m11s Dist command failed to produce a tarball: OSError:
python-munch-upstream debianize 2021-05-02T11:21 1m32s Dist command failed to produce a tarball: Exception: Versioning for this project requires either an sdist tarball, or access to an upstream git repository. It's also possible that there is a mismatch between the package name in setup.cfg and the argument given to pbr.version.VersionInfo. Project name munch was given, but was not able to be found.
python-murmurhash fresh-snapshots 2021-04-26T22:17 1m19s Dist command failed to produce a tarball: E: session:unstable-amd64-sbuild-4a0b84bd-fd20-4b23-99c8-af51efd0d126: Chroot not found
python-neutronclient fresh-snapshots 2021-04-05T02:47 1m26s Dist command failed to produce a tarball: Exception: Versioning for this project requires either an sdist tarball, or access to an upstream git repository. It's also possible that there is a mismatch between the package name in setup.cfg and the argument given to pbr.version.VersionInfo. Project name python-neutronclient was given, but was not able to be found.
python-oslo.concurrency fresh-snapshots 2021-04-05T06:07 1m0s Dist command failed to produce a tarball: Exception: Versioning for this project requires either an sdist tarball, or access to an upstream git repository. It's also possible that there is a mismatch between the package name in setup.cfg and the argument given to pbr.version.VersionInfo. Project name oslo.concurrency was given, but was not able to be found.
python-oslo.context fresh-snapshots 2021-04-05T03:30 51s Dist command failed to produce a tarball: Exception: Versioning for this project requires either an sdist tarball, or access to an upstream git repository. It's also possible that there is a mismatch between the package name in setup.cfg and the argument given to pbr.version.VersionInfo. Project name oslo.context was given, but was not able to be found.
python-oslo.rootwrap fresh-snapshots 2021-04-05T14:40 1m3s Dist command failed to produce a tarball: Exception: Versioning for this project requires either an sdist tarball, or access to an upstream git repository. It's also possible that there is a mismatch between the package name in setup.cfg and the argument given to pbr.version.VersionInfo. Project name oslo.rootwrap was given, but was not able to be found.
python-pbcore-upstream debianize 2021-05-02T08:19 2m13s Dist command failed to produce a tarball: SyntaxError: Missing parentheses in call to 'print'. Did you mean print("pbcore requires Python 2.7")?
python-pcl fresh-snapshots 2021-04-04T19:21 2m13s Dist command failed to produce a tarball: ./setup.py: error: cannot find PCL, tried
python-pybedtools-upstream debianize 2021-05-02T05:49 2m17s Dist command failed to produce a tarball: NameError: name 'cythonize' is not defined
python-pyface-upstream debianize 2021-05-02T05:46 2m35s Dist command failed to produce a tarball: AttributeError: 'str' object has no attribute 'decode'
python-pygerrit2 fresh-snapshots 2021-04-09T20:17 3m3s Dist command failed to produce a tarball: Exception: Versioning for this project requires either an sdist tarball, or access to an upstream git repository. It's also possible that there is a mismatch between the package name in setup.cfg and the argument given to pbr.version.VersionInfo. Project name pygerrit2 was given, but was not able to be found.
python-pygerrit2-upstream debianize 2021-04-14T11:27 9m35s Dist command failed to produce a tarball: Exception: Versioning for this project requires either an sdist tarball, or access to an upstream git repository. It's also possible that there is a mismatch between the package name in setup.cfg and the argument given to pbr.version.VersionInfo. Project name pygerrit2 was given, but was not able to be found.
python-pygit2-upstream debianize 2021-05-02T05:41 45s Dist command failed to produce a tarball: error: [Errno 2] No such file or directory: 'git'
python-pygtrie fresh-snapshots 2021-04-05T00:59 26s Dist command failed to produce a tarball: ValueError: Cannot find the version number
python-pygtrie-upstream debianize 2021-05-02T05:41 5m7s Dist command failed to produce a tarball: ValueError: Cannot find the version number
python-pyproj-upstream debianize 2021-05-02T05:20 3m1s Dist command failed to produce a tarball: proj executable not found. Please set the PROJ_DIR variable. For more information see: https://pyproj4.github.io/pyproj/stable/installation.html
python-pypubsub-upstream debianize 2021-04-30T19:57 2m58s IndexError: list index out of range
python-pysam fresh-snapshots 2021-04-27T01:45 1m35s Dist command failed to produce a tarball: configure: error: libbzip2 development files not found
python-pysam-upstream debianize 2021-05-02T05:15 55s Dist command failed to produce a tarball: ValueError: no cython installed, but can not find pysam/libchtslib.c.Make sure that cython is installed when building from the repository
python-schema-salad fresh-snapshots 2021-04-24T07:42 4m31s Dist command failed to produce a tarball: error: [Errno 2] No such file or directory: 'git'
python-schema-salad-upstream debianize 2021-03-23T18:32 2m44s Dist command failed: Dist command failed to produce a tarball: error: [Errno 2] No such file or directory: 'git'
python-shapely-upstream debianize 2021-05-02T03:39 37s Dist command failed to produce a tarball: OSError: Could not find library geos_c or load any of its variants ['libgeos_c.so.1', 'libgeos_c.so']
python-testfixtures-upstream debianize 2021-04-03T13:30 2m47s FileNotFoundError: [Errno 2] No such file or directory: 'testfixtures/version.txt'
python-testing.common.database fresh-snapshots 2021-04-05T09:55 27s Dist command failed to produce a tarball: ['python3', './setup.py', 'sdist'] failed with unidentified error (return code 1)
python-testing.mysqld-upstream debianize 2021-05-02T02:53 28s Dist command failed to produce a tarball: ['python3', './setup.py', 'sdist'] failed with unidentified error (return code 1)
python-testing.postgresql fresh-snapshots 2021-04-24T07:52 3m8s Dist command failed to produce a tarball: ['python3', './setup.py', 'sdist'] failed with unidentified error (return code 1)
python-testing.postgresql-upstream debianize 2021-05-02T02:52 33s Dist command failed to produce a tarball: ['python3', './setup.py', 'sdist'] failed with unidentified error (return code 1)
python-testtools fresh-snapshots 2021-04-24T09:15 5m56s Dist command failed to produce a tarball: Exception: Versioning for this project requires either an sdist tarball, or access to an upstream git repository. It's also possible that there is a mismatch between the package name in setup.cfg and the argument given to pbr.version.VersionInfo. Project name testtools was given, but was not able to be found.
python-traceback2 fresh-snapshots 2021-04-05T12:18 27s Dist command failed to produce a tarball: Exception: Versioning for this project requires either an sdist tarball, or access to an upstream git repository. It's also possible that there is a mismatch between the package name in setup.cfg and the argument given to pbr.version.VersionInfo. Project name traceback2 was given, but was not able to be found.
python-ua-parser fresh-snapshots 2021-04-08T17:11 50s Dist command failed to produce a tarball: error: [Errno 2] No such file or directory: 'git'
python-ua-parser-upstream debianize 2021-05-02T02:35 1m6s Dist command failed to produce a tarball: error: [Errno 2] No such file or directory: 'git'
pyzoltan-upstream debianize 2021-05-02T01:00 1m23s RuntimeError: There are no extension modules, Nothing to do!
pyzor-upstream debianize 2021-04-24T16:39 1m32s FileNotFoundError: [Errno 2] No such file or directory: 'setup.py'
pyzo-upstream debianize 2021-05-02T01:01 1m42s NameError: name 'find_packages' is not defined
rabbitvcs-upstream debianize 2021-05-01T13:33 1m52s IndexError: list index out of range
ragout-upstream debianize 2021-05-01T13:29 2m49s RuntimeError: 'distutils.core.setup()' was never called -- perhaps 'setup.py' is not a Distutils setup script?
rasterio-upstream debianize 2021-05-01T13:26 1m53s Dist command failed to produce a tarball: ['python', './setup.py', 'sdist'] failed with unidentified error (return code 1)
r-bioc-complexheatmap-upstream debianize 2021-05-03T16:17 2m8s Dist command failed to produce a tarball: Error: processing vignette 'most_probably_asked_questions.Rmd' failed with diagnostics:
r-bioc-delayedmatrixstats-upstream debianize 2021-05-02T00:02 2m5s Dist command failed to produce a tarball: Error: object 'ArrayRegularGrid' is not exported by 'namespace:DelayedArray'
r-bioc-ensembldb-upstream debianize 2021-05-03T16:05 5m10s Dist command failed to produce a tarball: Error: object 'path' is not exported by 'namespace:Rsamtools'
r-bioc-grohmm-upstream debianize 2021-05-04T21:19 3m3s Dist command failed to produce a tarball: Error: processing vignette 'groHMM.Rnw' failed with diagnostics:
r-bioc-metagenomeseq fresh-snapshots 2021-04-13T01:32 5h32m Dist command failed to produce a tarball: /usr/bin/texi2dvi: TeX neither supports -recorder nor outputs \openout lines in its log file
r-bioc-metagenomeseq-upstream debianize 2021-05-03T15:10 17m5s Dist command failed to produce a tarball: /usr/bin/texi2dvi: TeX neither supports -recorder nor outputs \openout lines in its log file
r-bioc-pcamethods-upstream debianize 2021-05-01T23:49 16m39s Dist command failed to produce a tarball: /usr/bin/texi2dvi: TeX neither supports -recorder nor outputs \openout lines in its log file
r-bioc-purecn-upstream debianize 2021-05-01T23:45 20m3s Dist command failed to produce a tarball: Error: processing vignette 'PureCN.Rnw' failed with diagnostics:
r-bioc-rsamtools-upstream debianize 2021-04-24T16:40 15m8s Dist command failed to produce a tarball: Error: processing vignette 'Rsamtools-Overview.Rnw' failed with diagnostics:
r-bioc-singler-upstream debianize 2021-05-01T23:26 16m54s Dist command failed to produce a tarball: Error: object 'I' is not exported by 'namespace:S4Vectors'
r-bioc-titancna-upstream debianize 2021-05-03T15:04 23m5s Dist command failed to produce a tarball: Error: processing vignette 'TitanCNA.Rnw' failed with diagnostics:
r-bioc-wrench-upstream debianize 2021-05-01T23:27 15m40s Dist command failed to produce a tarball: Error: processing vignette 'vignette.Rmd' failed with diagnostics:
r-bioc-zlibbioc fresh-snapshots 2021-04-19T11:06 3m2s Dist command failed to produce a tarball: /usr/bin/texi2dvi: TeX neither supports -recorder nor outputs \openout lines in its log file
r-cran-afex fresh-snapshots 2021-04-13T01:30 5h35m Dist command failed to produce a tarball: Error: processing vignette 'afex_analysing_accuracy_data.Rmd' failed with diagnostics:
r-cran-afex-upstream debianize 2021-05-01T23:21 22m19s Dist command failed to produce a tarball: Error: processing vignette 'afex_analysing_accuracy_data.Rmd' failed with diagnostics:
r-cran-amelia fresh-snapshots 2021-04-05T12:23 9m22s Dist command failed to produce a tarball: Error: processing vignette 'amelia.Rnw' failed with diagnostics:
r-cran-bbmisc-upstream debianize 2021-03-23T19:52 13s Dist command failed: Dist command failed to produce a tarball: Makefile:1: makeR/Makefile: No such file or directory
r-cran-bbmle-upstream debianize 2021-05-01T22:47 8m44s Dist command failed to produce a tarball: /usr/bin/texi2dvi: TeX neither supports -recorder nor outputs \openout lines in its log file
r-cran-bookdown-upstream debianize 2021-05-03T14:38 5m4s Dist command failed to produce a tarball: ['/usr/bin/R', 'CMD', 'build', '.'] failed with unidentified error (return code 1)
r-cran-bradleyterry2-upstream debianize 2021-05-01T22:07 3m29s Dist command failed to produce a tarball: /usr/bin/texi2dvi: TeX neither supports -recorder nor outputs \openout lines in its log file
r-cran-bridgesampling fresh-snapshots 2021-04-22T03:35 5m52s Dist command failed to produce a tarball: Error: processing vignette 'bridgesampling_example_jags.Rmd' failed with diagnostics:
r-cran-bridgesampling-upstream debianize 2021-05-03T14:29 7m0s Dist command failed to produce a tarball: Error: processing vignette 'bridgesampling_example_jags.Rmd' failed with diagnostics:
r-cran-brms-upstream debianize 2021-05-01T22:14 9m11s Dist command failed to produce a tarball: /usr/bin/texi2dvi: TeX neither supports -recorder nor outputs \openout lines in its log file
r-cran-brobdingnag-upstream debianize 2021-05-01T22:11 3m6s Dist command failed to produce a tarball: /usr/bin/texi2dvi: TeX neither supports -recorder nor outputs \openout lines in its log file
r-cran-cgdsr-upstream debianize 2021-05-01T21:51 1m59s Dist command failed to produce a tarball: Error: processing vignette 'cgdsr.Rnw' failed with diagnostics:
r-cran-clubsandwich-upstream debianize 2021-05-01T21:41 3m46s Dist command failed to produce a tarball: /usr/bin/texi2dvi: TeX neither supports -recorder nor outputs \openout lines in its log file
r-cran-conditionz-upstream debianize 2021-04-04T05:50 1m9s Dist command failed to produce a tarball: ['/usr/bin/R', 'CMD', 'build', '.'] failed with unidentified error (return code 1)
r-cran-contfrac fresh-snapshots 2021-04-09T19:28 2m49s Dist command failed to produce a tarball: Error: processing vignette 'contfrac.Rnw' failed with diagnostics:
r-cran-dbplyr fresh-snapshots 2021-04-09T18:52 3m59s Dist command failed to produce a tarball: ['/usr/bin/R', 'CMD', 'build', '.'] failed with unidentified error (return code 1)
r-cran-dbplyr-upstream debianize 2021-05-01T20:49 7m26s Dist command failed to produce a tarball: /usr/bin/texi2dvi: TeX neither supports -recorder nor outputs \openout lines in its log file
r-cran-dorng-upstream debianize 2021-05-01T20:35 5m21s Dist command failed to produce a tarball: /usr/bin/texi2dvi: TeX neither supports -recorder nor outputs \openout lines in its log file
r-cran-dplyr fresh-snapshots 2021-04-07T04:45 3m20s Dist command failed to produce a tarball: ['/usr/bin/R', 'CMD', 'build', '.'] failed with unidentified error (return code 1)
r-cran-dplyr-upstream debianize 2021-05-03T11:34 7m29s Dist command failed to produce a tarball: ['/usr/bin/R', 'CMD', 'build', '.'] failed with unidentified error (return code 1)
r-cran-dt-upstream debianize 2021-05-01T20:24 3m21s Dist command failed to produce a tarball: Error: processing vignette 'DT.Rmd' failed with diagnostics:
r-cran-elliptic fresh-snapshots 2021-04-05T22:42 13m43s Dist command failed to produce a tarball: Error: processing vignette 'ellipticpaper.Rnw' failed with diagnostics:
r-cran-elliptic-upstream debianize 2021-05-01T20:14 2m33s Dist command failed to produce a tarball: /usr/bin/texi2dvi: TeX neither supports -recorder nor outputs \openout lines in its log file
r-cran-emmeans fresh-snapshots 2021-04-05T10:19 8m8s Dist command failed to produce a tarball: Error: processing vignette 'sophisticated.Rmd' failed with diagnostics:
r-cran-emmeans-upstream debianize 2021-05-01T20:17 6m45s Dist command failed to produce a tarball: Error: processing vignette 'sophisticated.Rmd' failed with diagnostics:
r-cran-epiestim-upstream debianize 2021-05-03T10:49 5m55s Dist command failed to produce a tarball: Error: processing vignette 'full_EpiEstim_vignette.Rmd' failed with diagnostics:
r-cran-expint-upstream debianize 2021-05-01T20:04 2m56s Dist command failed to produce a tarball: /usr/bin/texi2dvi: TeX neither supports -recorder nor outputs \openout lines in its log file
r-cran-fitbitscraper-upstream debianize 2021-05-03T10:07 3m15s Dist command failed to produce a tarball: Error: processing vignette 'fitbitScraper-examples.Rmd' failed with diagnostics:
r-cran-fitdistrplus-upstream debianize 2021-05-03T10:10 6m51s Dist command failed to produce a tarball: /usr/bin/texi2dvi: TeX neither supports -recorder nor outputs \openout lines in its log file
r-cran-formatr fresh-snapshots 2021-04-04T23:27 2m22s Dist command failed to produce a tarball: Error: processing vignette 'formatR.Rmd' failed with diagnostics:
r-cran-formatr-upstream debianize 2021-05-01T18:49 3m29s Dist command failed to produce a tarball: Error: processing vignette 'formatR.Rmd' failed with diagnostics:
r-cran-gbm fresh-snapshots 2021-04-13T01:23 5h42m Dist command failed to produce a tarball: /usr/bin/texi2dvi: TeX neither supports -recorder nor outputs \openout lines in its log file
r-cran-generics fresh-snapshots 2021-04-09T19:08 2m42s Dist command failed to produce a tarball: ['/usr/bin/R', 'CMD', 'build', '.'] failed with unidentified error (return code 1)
r-cran-getoptlong-upstream debianize 2021-05-03T09:30 16m58s Dist command failed to produce a tarball: /usr/bin/texi2dvi: TeX neither supports -recorder nor outputs \openout lines in its log file
r-cran-ggally-upstream debianize 2021-05-01T17:42 7m0s Dist command failed to produce a tarball: /usr/bin/texi2dvi: TeX neither supports -recorder nor outputs \openout lines in its log file
r-cran-ggbeeswarm-upstream debianize 2021-05-01T17:39 3m12s Dist command failed to produce a tarball: /usr/bin/texi2dvi: TeX neither supports -recorder nor outputs \openout lines in its log file
r-cran-ggraph-upstream debianize 2021-05-01T17:34 5m10s Dist command failed to produce a tarball: Error: processing vignette 'Layouts.Rmd' failed with diagnostics:
r-cran-ggthemes-upstream debianize 2021-05-01T17:22 4m54s Dist command failed to produce a tarball: /usr/bin/texi2dvi: TeX neither supports -recorder nor outputs \openout lines in its log file
r-cran-globaloptions-upstream debianize 2021-05-01T17:18 3m9s Dist command failed to produce a tarball: /usr/bin/texi2dvi: TeX neither supports -recorder nor outputs \openout lines in its log file
r-cran-gnm fresh-snapshots 2021-04-13T01:27 3h17m Dist command failed to produce a tarball: /usr/bin/texi2dvi: TeX neither supports -recorder nor outputs \openout lines in its log file
r-cran-gnm-upstream debianize 2021-04-24T16:41 10m30s Dist command failed to produce a tarball: /usr/bin/texi2dvi: TeX neither supports -recorder nor outputs \openout lines in its log file
r-cran-googlevis-upstream debianize 2021-05-01T17:15 2m56s Dist command failed to produce a tarball: /usr/bin/texi2dvi: TeX neither supports -recorder nor outputs \openout lines in its log file
r-cran-gsl fresh-snapshots 2021-04-09T19:34 3m20s Dist command failed to produce a tarball: Error: processing vignette 'gslpaper.Rnw' failed with diagnostics:
r-cran-gsl-upstream debianize 2021-05-01T17:07 2m27s Dist command failed to produce a tarball: configure: error: gsl-config not found, is GSL installed?
r-cran-hdf5r-upstream debianize 2021-05-01T17:13 2m17s Dist command failed to produce a tarball: configure: error: hdf5 does not seem to be installed on your platform.
r-cran-hexbin-upstream debianize 2021-05-01T17:06 4m2s Dist command failed to produce a tarball: /usr/bin/texi2dvi: TeX neither supports -recorder nor outputs \openout lines in its log file
r-cran-highr fresh-snapshots 2021-04-05T01:22 2m16s Dist command failed to produce a tarball: Error: processing vignette 'highr-custom.Rmd' failed with diagnostics:
r-cran-highr-upstream debianize 2021-05-03T08:35 15m27s Dist command failed to produce a tarball: Error: processing vignette 'highr-custom.Rmd' failed with diagnostics:
r-cran-irlba-upstream debianize 2021-04-09T20:21 2m47s Dist command failed to produce a tarball: /usr/bin/texi2dvi: TeX neither supports -recorder nor outputs \openout lines in its log file
r-cran-knitr-upstream debianize 2021-04-25T13:36 3m6s Dist command failed to produce a tarball: ['/usr/bin/R', 'CMD', 'build', '.'] failed with unidentified error (return code 1)
r-cran-lavasearch2-upstream debianize 2021-04-24T16:41 15m38s Dist command failed to produce a tarball: /usr/bin/texi2dvi: TeX neither supports -recorder nor outputs \openout lines in its log file
r-cran-lava-upstream debianize 2021-04-06T19:00 3m42s Dist command failed to produce a tarball: Error: processing vignette 'correlation.Rmd' failed with diagnostics:
r-cran-lsmeans fresh-snapshots 2021-04-05T03:46 40m43s Dist command failed to produce a tarball: Error: processing vignette 'sophisticated.Rmd' failed with diagnostics:
r-cran-magic fresh-snapshots 2021-04-09T20:13 2m50s Dist command failed to produce a tarball: /usr/bin/texi2dvi: TeX neither supports -recorder nor outputs \openout lines in its log file
r-cran-maldiquantforeign fresh-snapshots 2021-04-09T20:14 3m13s Dist command failed to produce a tarball: /usr/bin/texi2dvi: TeX neither supports -recorder nor outputs \openout lines in its log file
r-cran-maldiquantforeign-upstream debianize 2021-05-03T07:25 21m13s Dist command failed to produce a tarball: /usr/bin/texi2dvi: TeX neither supports -recorder nor outputs \openout lines in its log file
r-cran-manipulatewidgets fresh-snapshots 2021-04-22T03:38 3m26s Dist command failed to produce a tarball: Error: processing vignette 'manipulateWidgets.Rmd' failed with diagnostics:
r-cran-matchit-upstream debianize 2021-05-03T07:24 22m18s Dist command failed to produce a tarball: Error: processing vignette 'MatchIt.Rmd' failed with diagnostics:
r-cran-metafor fresh-snapshots 2021-04-19T22:37 9m42s Dist command failed to produce a tarball: /usr/bin/texi2dvi: TeX neither supports -recorder nor outputs \openout lines in its log file
r-cran-metafor-upstream debianize 2021-05-03T07:23 23m13s Dist command failed to produce a tarball: /usr/bin/texi2dvi: TeX neither supports -recorder nor outputs \openout lines in its log file
r-cran-mets-upstream debianize 2021-05-03T07:22 24m22s Dist command failed to produce a tarball: Error: processing vignette 'basic-dutils.Rmd' failed with diagnostics:
r-cran-mnp fresh-snapshots 2021-04-13T01:49 5m50s Dist command failed to produce a tarball: /usr/bin/texi2dvi: TeX neither supports -recorder nor outputs \openout lines in its log file
r-cran-mnp-upstream debianize 2021-05-03T07:15 5m8s Dist command failed to produce a tarball: /usr/bin/texi2dvi: TeX neither supports -recorder nor outputs \openout lines in its log file
r-cran-network-upstream debianize 2021-05-03T06:24 16m48s Dist command failed to produce a tarball: /usr/bin/texi2dvi: TeX neither supports -recorder nor outputs \openout lines in its log file
r-cran-nloptr fresh-snapshots 2021-04-05T09:02 2m48s Dist command failed to produce a tarball: Error: processing vignette 'nloptr.Rmd' failed with diagnostics:
r-cran-nmf fresh-snapshots 2021-04-24T09:22 32m32s Dist command failed to produce a tarball: /usr/bin/texi2dvi: TeX neither supports -recorder nor outputs \openout lines in its log file
r-cran-parameters-upstream debianize 2021-05-01T16:35 6m7s Dist command failed to produce a tarball: Error: processing vignette 'model_parameters.Rmd' failed with diagnostics:
r-cran-pbdzmq fresh-snapshots 2021-04-09T19:03 3m37s Dist command failed to produce a tarball: Error: processing vignette 'pbdZMQ-guide.Rnw' failed with diagnostics:
r-cran-performance-upstream debianize 2021-05-01T16:30 3m21s Dist command failed to produce a tarball: ['/usr/bin/R', 'CMD', 'build', '.'] failed with unidentified error (return code 1)
r-cran-permute fresh-snapshots 2021-04-13T01:34 3h13m Dist command failed to produce a tarball: /usr/bin/texi2dvi: TeX neither supports -recorder nor outputs \openout lines in its log file
r-cran-permute-upstream debianize 2021-05-01T16:28 2m7s Dist command failed to produce a tarball: /usr/bin/texi2dvi: TeX neither supports -recorder nor outputs \openout lines in its log file
r-cran-phangorn fresh-snapshots 2021-04-13T01:35 5h19m Dist command failed to produce a tarball: Error: processing vignette 'AdvancedFeatures.Rmd' failed with diagnostics:
r-cran-phylobase-upstream debianize 2021-05-01T16:24 5m27s Dist command failed to produce a tarball: /usr/bin/texi2dvi: TeX neither supports -recorder nor outputs \openout lines in its log file
r-cran-pillar fresh-snapshots 2021-04-09T18:53 11m29s Dist command failed to produce a tarball: Error: processing vignette 'numbers.Rmd' failed with diagnostics:
r-cran-pillar-upstream debianize 2021-05-01T16:22 2m21s Dist command failed to produce a tarball: ['/usr/bin/R', 'CMD', 'build', '.'] failed with unidentified error (return code 1)
r-cran-pls fresh-snapshots 2021-04-26T19:45 3m18s Dist command failed to produce a tarball: /usr/bin/texi2dvi: TeX neither supports -recorder nor outputs \openout lines in its log file
r-cran-pls-upstream debianize 2021-05-01T16:17 2m36s Dist command failed to produce a tarball: /usr/bin/texi2dvi: TeX neither supports -recorder nor outputs \openout lines in its log file
r-cran-polycub-upstream debianize 2021-05-01T16:13 3m28s Dist command failed to produce a tarball: Error: processing vignette 'polyCub.Rmd' failed with diagnostics:
r-cran-proto fresh-snapshots 2021-04-09T20:18 4m19s Dist command failed to produce a tarball: /usr/bin/texi2dvi: TeX neither supports -recorder nor outputs \openout lines in its log file
r-cran-proto-upstream debianize 2021-05-03T04:20 23m22s Dist command failed to produce a tarball: /usr/bin/texi2dvi: TeX neither supports -recorder nor outputs \openout lines in its log file
r-cran-qtl fresh-snapshots 2021-04-26T19:46 10m48s Dist command failed to produce a tarball: /usr/bin/texi2dvi: TeX neither supports -recorder nor outputs \openout lines in its log file
r-cran-qtl-upstream debianize 2021-05-01T15:54 5m27s Dist command failed to produce a tarball: /usr/bin/texi2dvi: TeX neither supports -recorder nor outputs \openout lines in its log file
r-cran-rcppgsl fresh-snapshots 2021-04-09T19:03 5m9s Dist command failed to produce a tarball: Error: processing vignette 'RcppGSL-intro.Rnw' failed with diagnostics:
r-cran-rdpack-upstream debianize 2021-05-01T15:47 3m26s Dist command failed to produce a tarball: /usr/bin/texi2dvi: TeX neither supports -recorder nor outputs \openout lines in its log file
r-cran-recipes-upstream debianize 2021-05-01T15:47 4m12s Dist command failed to produce a tarball: Error: processing vignette 'Custom_Steps.Rmd' failed with diagnostics:
r-cran-rex-upstream debianize 2021-04-03T12:47 1m42s Dist command failed to produce a tarball: Error: processing vignette 'log_parsing.Rmd' failed with diagnostics:
r-cran-rlang fresh-snapshots 2021-04-13T01:24 3h20m Dist command failed to produce a tarball: /usr/bin/texi2dvi: TeX neither supports -recorder nor outputs \openout lines in its log file
r-cran-rlang-upstream debianize 2021-05-01T15:40 2m58s Dist command failed to produce a tarball: /usr/bin/texi2dvi: TeX neither supports -recorder nor outputs \openout lines in its log file
r-cran-rms fresh-snapshots 2021-04-05T09:06 2m10s Dist command failed to produce a tarball: cp: cannot stat 'r-cran-rms/.Rbuildignore': No such file or directory
r-cran-rnexml-upstream debianize 2021-05-03T03:00 8m49s Dist command failed to produce a tarball: Error: processing vignette 'intro.Rmd' failed with diagnostics:
r-cran-rocr fresh-snapshots 2021-03-28T00:50 3m47s Dist command failed to produce a tarball: Error: processing vignette 'ROCR.Rmd' failed with diagnostics:
r-cran-rsample-upstream debianize 2021-05-13T03:41 8m1s Dist command failed to produce a tarball: Error: processing vignette 'Working_with_rsets.Rmd' failed with diagnostics:
r-cran-runit fresh-snapshots 2021-04-09T18:56 3m23s Dist command failed to produce a tarball: ['/usr/bin/R', 'CMD', 'build', '.'] failed with unidentified error (return code 1)
r-cran-rvest-upstream debianize 2021-05-03T02:28 11m9s Dist command failed to produce a tarball: ['/usr/bin/R', 'CMD', 'build', '.'] failed with unidentified error (return code 1)
r-cran-scales fresh-snapshots 2021-04-09T20:22 13m45s Dist command failed to produce a tarball: ['/usr/bin/R', 'CMD', 'build', '.'] failed with unidentified error (return code 1)
r-cran-scales-upstream debianize 2021-05-01T15:09 2m51s Dist command failed to produce a tarball: /usr/bin/texi2dvi: TeX neither supports -recorder nor outputs \openout lines in its log file
r-cran-seriation-upstream debianize 2021-05-01T15:05 3m22s Dist command failed to produce a tarball: /usr/bin/texi2dvi: TeX neither supports -recorder nor outputs \openout lines in its log file
r-cran-sf-upstream debianize 2021-05-01T15:00 4m14s Dist command failed to produce a tarball: configure: error: gdal-config not found or not executable.
r-cran-sjmisc-upstream debianize 2021-05-01T14:46 2m52s Dist command failed to produce a tarball: Error: processing vignette 'exploringdatasets.Rmd' failed with diagnostics:
r-cran-sjplot-upstream debianize 2021-05-01T14:44 5m9s Dist command failed to produce a tarball: Error: object 'cronb' is not exported by 'namespace:sjstats'
r-cran-sp fresh-snapshots 2021-04-05T22:52 6m57s Dist command failed to produce a tarball: Error: processing vignette 'csdacm.Rnw' failed with diagnostics:
r-cran-spacetime-upstream debianize 2021-05-01T14:35 3m38s Dist command failed to produce a tarball: /usr/bin/texi2dvi: TeX neither supports -recorder nor outputs \openout lines in its log file
r-cran-spatstat-upstream debianize 2021-05-01T14:27 7m20s Dist command failed to produce a tarball: /usr/bin/texi2dvi: TeX neither supports -recorder nor outputs \openout lines in its log file
r-cran-spdep-upstream debianize 2021-05-01T14:28 6m19s Dist command failed to produce a tarball: Error: processing vignette 'nb_sf.Rmd' failed with diagnostics:
r-cran-sp-upstream debianize 2021-05-01T14:39 3m4s Dist command failed to produce a tarball: /usr/bin/texi2dvi: TeX neither supports -recorder nor outputs \openout lines in its log file
r-cran-stars-upstream debianize 2021-05-01T14:23 4m8s Dist command failed to produce a tarball: Error: processing vignette 'stars1.Rmd' failed with diagnostics:
r-cran-tibble fresh-snapshots 2021-04-07T15:49 2m36s Dist command failed to produce a tarball: ['/usr/bin/R', 'CMD', 'build', '.'] failed with unidentified error (return code 1)
r-cran-tibble-upstream debianize 2021-05-01T14:14 2m36s Dist command failed to produce a tarball: ['/usr/bin/R', 'CMD', 'build', '.'] failed with unidentified error (return code 1)
r-cran-tikzdevice-upstream debianize 2021-05-01T14:13 2m54s Dist command failed to produce a tarball: Error: processing vignette 'tikzDevice.Rnw' failed with diagnostics:
r-cran-treespace-upstream debianize 2021-05-03T01:06 12m48s Dist command failed to produce a tarball: Error: processing vignette 'DengueVignette.Rmd' failed with diagnostics:
r-cran-tsp-upstream debianize 2021-05-04T22:13 1m57s Dist command failed to produce a tarball: /usr/bin/texi2dvi: TeX neither supports -recorder nor outputs \openout lines in its log file
r-cran-units-upstream debianize 2021-05-01T14:06 2m17s Dist command failed to produce a tarball: configure: error: in `/tmp/Rtmpgs2aJ9/Rbuild3fd3e73fb6e5a3/units':
r-cran-uroot-upstream debianize 2021-04-30T15:49 2m42s Dist command failed to produce a tarball: /usr/bin/texi2dvi: TeX neither supports -recorder nor outputs \openout lines in its log file
r-cran-vcdextra-upstream debianize 2021-05-03T00:44 19m7s Dist command failed to produce a tarball: /usr/bin/texi2dvi: TeX neither supports -recorder nor outputs \openout lines in its log file
r-cran-vegan-upstream debianize 2021-04-30T15:30 7m15s Dist command failed to produce a tarball: /usr/bin/texi2dvi: TeX neither supports -recorder nor outputs \openout lines in its log file
r-cran-xfun fresh-snapshots 2021-04-08T15:57 3m12s Dist command failed to produce a tarball: Error: processing vignette 'xfun.Rmd' failed with diagnostics:
r-cran-xfun-upstream debianize 2021-05-01T13:41 2m41s Dist command failed to produce a tarball: Error: processing vignette 'xfun.Rmd' failed with diagnostics:
r-cran-xml2 fresh-snapshots 2021-04-09T19:06 5m16s Dist command failed to produce a tarball: ['/usr/bin/R', 'CMD', 'build', '.'] failed with unidentified error (return code 1)
r-cran-xml2-upstream debianize 2021-05-01T13:41 2m52s Dist command failed to produce a tarball: /usr/bin/texi2dvi: TeX neither supports -recorder nor outputs \openout lines in its log file
r-cran-xts fresh-snapshots 2021-04-09T18:57 6m31s Dist command failed to produce a tarball: Error: processing vignette 'xts-faq.Rnw' failed with diagnostics:
r-cran-xts-upstream debianize 2021-05-03T00:22 3m53s Dist command failed to produce a tarball: /usr/bin/texi2dvi: TeX neither supports -recorder nor outputs \openout lines in its log file
readucks-upstream debianize 2021-05-01T13:16 1m48s urllib.error.HTTPError: HTTP Error 403: SSL is required
reptyr fresh-snapshots 2021-04-04T10:38 10s Dist command failed to produce a tarball: ['apt', '-y', 'satisfy', 'debhelper (>= 7.0.50~), dpkg-dev (>= 1.16.1~), python, python-pexpect'] failed with unidentified error (return code 100)
rex-upstream debianize 2021-05-01T12:58 3m49s Dist command failed to produce a tarball: ['/usr/bin/dzil', 'build', '--tgz'] failed with unidentified error (return code 255)
rhash fresh-snapshots 2021-04-08T16:57 57s Dist command failed to produce a tarball: Makefile:2: config.mak: No such file or directory
ripperx fresh-snapshots 2021-04-05T09:03 48s Dist command failed to produce a tarball: configure.ac:47: error: required file 'config/config.rpath' not found
ristretto fresh-snapshots 2021-04-05T09:51 1m13s Dist command failed to produce a tarball: cp: cannot stat './ChangeLog': No such file or directory
rlwrap fresh-snapshots 2021-04-05T01:59 3m41s Dist command failed to produce a tarball: make[2]: *** No rule to make target 'filters/RlwrapFilter.3pm', needed by 'distdir-am'. Stop.
robocode fresh-snapshots 2021-04-05T07:13 9m2s Dist command failed to produce a tarball: /build/tmpyavs2rck/robocode/robocode.roborumble/src/main/java/roborumble/RoboRumbleAtHome.java:27: error: unmappable character (0xC3) for encoding US-ASCII
ros-catkin fresh-snapshots 2021-04-05T06:48 1m46s Dist command failed to produce a tarball: Error: No files in <filelist> section of package.xml
ros-cmake-modules fresh-snapshots 2021-04-05T03:52 1m10s Dist command failed to produce a tarball: Error: No files in <filelist> section of package.xml
ros-eigen-stl-containers fresh-snapshots 2021-04-05T11:33 12m55s Dist command failed to produce a tarball: Error: No files in <filelist> section of package.xml
ros-genmsg fresh-snapshots 2021-04-05T00:56 1m24s Dist command failed to produce a tarball: Error: No files in <filelist> section of package.xml
ros-genpy fresh-snapshots 2021-04-05T10:52 1m26s Dist command failed to produce a tarball: Error: No files in <filelist> section of package.xml
ros-python-qt-binding fresh-snapshots 2021-04-05T13:31 1m31s Dist command failed to produce a tarball: Error: No files in <filelist> section of package.xml
ros-rosconsole-bridge fresh-snapshots 2021-04-05T14:04 1m22s Dist command failed to produce a tarball: Error: No files in <filelist> section of package.xml
ros-std-msgs fresh-snapshots 2021-04-05T10:27 1m23s Dist command failed to produce a tarball: Error: No files in <filelist> section of package.xml
rtkit-upstream debianize 2021-05-01T12:51 30s Dist command failed to produce a tarball: meson.build:16:0: ERROR: Program 'xxd' not found
rtmidi-upstream debianize 2021-05-01T12:50 7s Dist command failed to produce a tarball: ['./autogen.sh'] failed with unidentified error (return code 1)
ruby-columnize fresh-snapshots 2021-04-08T16:23 1m0s Dist command failed to produce a tarball: make: *** [Makefile:15: dist] Error 1
sambamba fresh-snapshots 2021-04-07T17:32 2m26s Dist command failed to produce a tarball: meson.build:119:0: ERROR: Expecting rbracket got rparen.
sambamba-upstream debianize 2021-05-01T12:46 1m6s Dist command failed to produce a tarball: meson.build:119:0: ERROR: Expecting rbracket got rparen.
samtools-legacy-upstream debianize 2021-05-01T12:42 25s Dist command failed to produce a tarball: config.mk:34: ../htslib/htslib_static.mk: No such file or directory
samtools-upstream debianize 2021-05-02T23:34 51s Dist command failed to produce a tarball: config.mk:34: ../htslib/htslib_static.mk: No such file or directory
scalapack fresh-snapshots 2021-04-05T03:08 1m6s Dist command failed to produce a tarball: Makefile:17: SLmake.inc: No such file or directory
scalpel fresh-snapshots 2021-04-24T09:29 47s Dist command failed to produce a tarball: Makefile.am: error: required file './ChangeLog' not found
scanmem fresh-snapshots 2021-04-26T19:10 1m22s Dist command failed to produce a tarball: make[3]: *** No rule to make target 'distdir'. Stop.
schism fresh-snapshots 2021-04-05T15:57 2m17s Dist command failed to produce a tarball: make[2]: *** No rule to make target 'sys/fd.org/itf.desktop', needed by 'distdir-am'. Stop.
seahorse-nautilus fresh-snapshots 2021-03-28T02:50 1m12s Dist command failed to produce a tarball: E: Failed to execute “meson”: Permission denied
seq24 fresh-snapshots 2021-04-05T11:27 1m31s Dist command failed to produce a tarball: make[2]: *** No rule to make target 'src/configwin32.h', needed by 'distdir-am'. Stop.
setuptools-scm-upstream debianize 2021-05-01T12:09 1m44s AssertionError: Can't parse version upstream/6.0.1
setzer-upstream debianize 2021-05-01T12:08 48s Dist command failed to produce a tarball: data/meson.build:21:0: ERROR: Tried to assign an invalid value to variable.
sfepy-upstream debianize 2021-05-01T12:06 1m45s Dist command failed to produce a tarball: RuntimeError: cython is missing
shairport-sync fresh-snapshots 2021-04-05T03:55 1m17s Dist command failed to produce a tarball: configure: error: specify one of --with-ssl=openssl or --with-ssl=mbedtls or --with-ssl=polarssl
shapelib fresh-snapshots 2021-04-05T01:27 39s Dist command failed to produce a tarball: ['./autogen.sh'] failed with unidentified error (return code 1)
shapelib-upstream debianize 2021-05-01T11:55 4s Dist command failed to produce a tarball: ['./autogen.sh'] failed with unidentified error (return code 1)
simple-image-reducer fresh-snapshots 2021-04-24T07:26 2m3s Dist command failed to produce a tarball: cp: cannot stat 'README': No such file or directory
simple-image-reducer-upstream debianize 2021-05-01T09:29 3s Dist command failed to produce a tarball: cp: cannot stat 'po/*.mo': No such file or directory
singular fresh-snapshots 2021-04-24T08:34 11m6s Dist command failed to produce a tarball: /usr/bin/eatmydata: 83: exec: ./configure: Permission denied
sipgrep fresh-snapshots 2021-04-24T01:56 4m11s Dist command failed to produce a tarball: make: *** [Makefile:277: Makefile.in] Error 1
siril-upstream debianize 2021-05-01T09:26 3m7s Dist command failed to produce a tarball: ERROR: Both directories contain a build file meson.build.
skycat-upstream debianize 2021-05-01T11:11 19s Dist command failed to produce a tarball: configure: error: ../tclutil/tclutilConfig.sh doesn't exist
slic3r fresh-snapshots 2021-04-04T15:05 1m56s Dist command failed to produce a tarball: ['perl', 'Build.PL'] failed with unidentified error (return code 2)
snakemake-upstream debianize 2021-05-13T06:03 18m8s RuntimeError: 'distutils.core.setup()' was never called -- perhaps 'setup.py' is not a Distutils setup script?
sndfile-tools-upstream debianize 2021-05-01T09:30 34s Dist command failed to produce a tarball: ['./autogen.sh'] failed with unidentified error (return code 1)
sonic-visualiser fresh-snapshots 2021-04-24T00:47 18m8s Dist command failed to produce a tarball: cp: cannot stat 'piper-vamp-cpp/vamp-capnp/piper.capnp.h': No such file or directory
sooperlooper-upstream debianize 2021-05-02T21:47 1m7s Dist command failed to produce a tarball: ['./autogen.sh'] failed with unidentified error (return code 1)
spectrwm fresh-snapshots 2021-04-05T14:10 1m54s Dist command failed to produce a tarball: Makefile:1: *** missing separator. Stop.
speech-dispatcher fresh-snapshots 2021-04-24T08:23 3m37s Dist command failed to produce a tarball: make[6]: *** No rule to make target '../../src/common/libcommon.la', needed by 'speech-dispatcher'. Stop.
sphinx-click-upstream debianize 2021-05-01T10:17 46s Dist command failed to produce a tarball: Exception: Versioning for this project requires either an sdist tarball, or access to an upstream git repository. It's also possible that there is a mismatch between the package name in setup.cfg and the argument given to pbr.version.VersionInfo. Project name sphinx-click was given, but was not able to be found.
sphinxcontrib-spelling fresh-snapshots 2021-04-05T09:12 1m6s Dist command failed to produce a tarball: Exception: Versioning for this project requires either an sdist tarball, or access to an upstream git repository. It's also possible that there is a mismatch between the package name in setup.cfg and the argument given to pbr.version.VersionInfo. Project name sphinxcontrib-spelling was given, but was not able to be found.
sphinxcontrib-spelling-upstream debianize 2021-05-01T10:16 40s Dist command failed to produce a tarball: Exception: Versioning for this project requires either an sdist tarball, or access to an upstream git repository. It's also possible that there is a mismatch between the package name in setup.cfg and the argument given to pbr.version.VersionInfo. Project name sphinxcontrib-spelling was given, but was not able to be found.
spice fresh-snapshots 2021-03-23T18:58 37m16s
squid fresh-snapshots 2021-04-26T19:11 8m44s Dist command failed to produce a tarball: make[2]: *** No rule to make target 'SPONSORS', needed by 'distdir-am'. Stop.
sra-sdk fresh-snapshots 2021-04-04T20:26 3m8s Dist command failed to produce a tarball: /build/tmplahcwsvf/sra-sdk/build/Makefile.shell:27: *** "*** File '/build/tmplahcwsvf/sra-sdk/build/Makefile.config' is missing. Please run /build/tmplahcwsvf/sra-sdk/configure". Stop.
sra-sdk-upstream debianize 2021-03-23T19:33 2m55s Dist command failed: Dist command failed to produce a tarball: /build/tmpuj2j0jos/package/build/Makefile.shell:27: *** "*** File '/build/tmpuj2j0jos/package/build/Makefile.config' is missing. Please run /build/tmpuj2j0jos/package/configure". Stop.
sshguard fresh-snapshots 2021-03-28T02:16 40s Dist command failed to produce a tarball: make[2]: *** No rule to make target 'doc/sshguard-setup.7', needed by 'distdir-am'. Stop.
sslsplit fresh-snapshots 2021-04-13T01:33 43m44s Dist command failed to produce a tarball: make: *** [GNUmakefile:594: sslsplit-dcce1ab.tar.bz2.asc] Error 2
starlink-ast-upstream debianize 2021-05-01T09:49 4m21s Dist command failed to produce a tarball: configure.ac:27: error: require Automake 1.8.2-starlink, but have 1.16.3
starlink-pal-upstream debianize 2021-05-01T09:47 43s Dist command failed to produce a tarball: configure.ac:11: error: require Automake 1.8.2-starlink, but have 1.16.3
starman-upstream debianize 2021-05-02T19:13 2m32s Dist command failed to produce a tarball: ['perl', 'Makefile.PL'] failed with unidentified error (return code 255)
startpar fresh-snapshots 2021-04-24T09:47 1m41s Dist command failed to produce a tarball: gpg: signing failed: Inappropriate ioctl for device
statsmodels-upstream debianize 2021-03-23T20:00 3m40s Broken apt packages: Depends: python3-numpy (= 1.19.4) but 1:1.19.5-1 is to be installed
stopmotion fresh-snapshots 2021-04-04T11:42 1m18s Dist command failed to produce a tarball: cp: cannot stat 'build/stopmotion_zh_TW.qm': No such file or directory
storm-upstream debianize 2021-05-02T19:05 5m52s Dist command failed to produce a tarball: SyntaxError: invalid syntax
subdownloader-upstream debianize 2021-03-23T19:50 16m40s Missing file: /build/tmp2ra75yk8/package/requirements.txt
sugar-pippy-activity fresh-snapshots 2021-04-24T04:35 10m42s Dist command failed to produce a tarball: ./setup.py: error: argument command: invalid choice: 'sdist' (choose from 'install', 'check', 'dist_xo', 'dist_source', 'build', 'fix_manifest', 'genpot', 'dev')
sunpy-upstream debianize 2021-03-23T19:56 20m19s subprocess.CalledProcessError: Command '['/usr/bin/python', '-m', 'pip', '--disable-pip-version-check', 'wheel', '--no-deps', '-w', '/tmp/tmphelyzs00', '--quiet', 'setuptools_scm']' returned non-zero exit status 1.
supertux-upstream debianize 2021-04-24T20:59 12m39s Dist command failed to produce a tarball: -- Configuring incomplete, errors occurred!
swift fresh-snapshots 2021-04-05T15:49 7m21s Dist command failed to produce a tarball: Exception: Versioning for this project requires either an sdist tarball, or access to an upstream git repository. It's also possible that there is a mismatch between the package name in setup.cfg and the argument given to pbr.version.VersionInfo. Project name swift was given, but was not able to be found.
swiglpk-upstream debianize 2021-05-04T16:21 38s Dist command failed to produce a tarball: subprocess.CalledProcessError: Command '['which', 'glpsol']' returned non-zero exit status 1.
systemd fresh-snapshots 2021-04-24T09:51 17m28s Dist command failed to produce a tarball: ninja: build stopped: subcommand failed.
systemfixtures-upstream debianize 2021-05-02T18:42 1m11s Dist command failed to produce a tarball: Exception: Versioning for this project requires either an sdist tarball, or access to an upstream git repository. It's also possible that there is a mismatch between the package name in setup.cfg and the argument given to pbr.version.VersionInfo. Project name systemfixtures was given, but was not able to be found.
tclreadline fresh-snapshots 2021-04-08T16:31 48s Dist command failed to produce a tarball: make[2]: *** No rule to make target 'aux/ltconfig', needed by 'distdir-am'. Stop.
tcptraceroute fresh-snapshots 2021-04-27T00:50 19s Dist command failed to produce a tarball: make: *** [Makefile:126: Makefile.in] Error 1
tdom fresh-snapshots 2021-03-28T02:01 1m49s Dist command failed to produce a tarball: cp: cannot stat './license*': No such file or directory
texinfo fresh-snapshots 2021-04-24T08:18 23m0s Dist command failed to produce a tarball: make[3]: *** No rule to make target '../gnulib/lib/libgnu.a', needed by 'makedoc'. Stop.
tinyows-upstream debianize 2021-05-04T16:06 52s Dist command failed to produce a tarball: configure: error: couldn't find xml2-config, try using --with-xml2-config=PATH
tio fresh-snapshots 2021-03-26T17:11 10m52s Dist command failed to produce a tarball: E: Failed to execute “./autogen.sh”: Exec format error
tmd710-tncsetup-upstream debianize 2021-04-13T01:46 3m1s Dist command failed to produce a tarball: make: *** [Makefile:34: dist] Error 1
torbrowser-launcher fresh-snapshots 2021-04-24T09:56 7m59s Dist command failed to produce a tarball: AttributeError: module 'platform' has no attribute 'dist'
tpm2-abrmd fresh-snapshots 2021-03-26T17:12 16m53s Dist command failed to produce a tarball: make[2]: *** No rule to make target 'VERSION', needed by 'distdir-am'. Stop.
treeviewx-upstream debianize 2021-05-04T16:02 46s Dist command failed to produce a tarball: Makefile.am: error: required file './ChangeLog' not found
ts-node-upstream debianize 2021-05-02T18:27 6m14s Dist command failed to produce a tarball: npm ERR! code 2
twolame fresh-snapshots 2021-03-27T23:55 2h19m Dist command failed to produce a tarball: cp: cannot stat './doxygen.png': No such file or directory
twolame-upstream debianize 2021-05-02T18:23 4m12s Dist command failed to produce a tarball: ['./autogen.sh'] failed with unidentified error (return code 1)
uim fresh-snapshots 2021-03-24T14:34 11m46s Dist command failed: Dist command failed to produce a tarball: make[6]: *** No rule to make target 'index.html', needed by 'distdir-am'. Stop.
unicycler-upstream debianize 2021-05-03T18:05 7m23s urllib.error.HTTPError: HTTP Error 403: SSL is required
unpaper fresh-snapshots 2021-04-13T01:28 1h2m Dist command failed to produce a tarball: meson.build:8:4: ERROR: Problem encountered: Meson 0.57 or later required
usbmuxd fresh-snapshots 2021-03-27T19:20 17m35s Dist command failed to produce a tarball: make[2]: *** [Makefile:533: distdir-am] Error 1
valgrind fresh-snapshots 2021-04-27T01:01 3m3s Dist command failed to produce a tarball: make[5]: *** [Makefile:670: print-docs] Error 127
varconf-upstream debianize 2021-05-15T01:13 1d21h Dist command failed to produce a tarball: E: PAM error: Authentication failure
vdjtools-upstream debianize 2021-03-24T23:17 15m27s Dist command failed: Dist command failed to produce a tarball: command ['./gradlew', 'distTar'] failed with unidentified error (return code 1)
verilator-upstream debianize 2021-05-04T15:08 4m57s Dist command failed to produce a tarball: configure: error: Cannot find "python3" in your PATH, please install it
vf1-upstream debianize 2021-04-03T03:56 2m37s File "<string>", line 2, in <module>
viking fresh-snapshots 2021-04-24T04:47 13m52s Dist command failed to produce a tarball: cp: cannot stat './C/figures/addtr_18.png': No such file or directory
vkbasalt-upstream debianize 2021-05-04T15:03 49s Dist command failed to produce a tarball: E: session:unstable-amd64-sbuild-ea8ea859-f03a-4e9e-8722-2d3fe7813f22: Chroot not found
w3m-el fresh-snapshots 2021-04-27T04:22 5m25s Dist command failed to produce a tarball: make[1]: *** No rule to make target 'CVS/Root', needed by 'tarball'. Stop.
w3m-el-snapshot fresh-snapshots 2021-04-05T06:33 14m47s Dist command failed to produce a tarball: make[1]: *** No rule to make target 'CVS/Root', needed by 'tarball'. Stop.
wavpack-upstream debianize 2021-05-04T14:11 52m32s Dist command failed to produce a tarball: E: Failed to change to directory ‘/build/tmpzj6xy80a/package’: No such file or directory
wdm fresh-snapshots 2021-04-24T08:23 2m17s Dist command failed to produce a tarball: configure: error: 'get-wings-flags' command was not found in $PATH, please upgrade your WindowMaker.
webauth fresh-snapshots 2021-03-24T15:29 28m37s Dist command failed: Dist command failed to produce a tarball: configure: error: cannot find usable OpenSSL library
webrtc-audio-processing fresh-snapshots 2021-04-26T23:29 1m36s Dist command failed to produce a tarball: meson.build:15:0: ERROR: Index 1 out of bounds of array of size 1.
x42-plugins fresh-snapshots 2021-04-24T08:34 10m57s Dist command failed to produce a tarball: make[1]: *** [Makefile.git:12: tagupdate] Error 128
xastir-upstream debianize 2021-03-23T19:23 6m44s Dist command failed: Dist command failed to produce a tarball: configure: error: *** No X11! Install X-Windows development headers/libraries! ***
xfce4-dev-tools fresh-snapshots 2021-04-05T02:06 54s Dist command failed to produce a tarball: cp: cannot stat './ChangeLog': No such file or directory
xfce4-power-manager fresh-snapshots 2021-04-05T16:35 2m38s Dist command failed to produce a tarball: cp: cannot stat './ChangeLog': No such file or directory
xfce4-terminal fresh-snapshots 2021-03-27T23:57 57m36s Dist command failed to produce a tarball: cp: cannot stat './ChangeLog': No such file or directory
xfwm4 fresh-snapshots 2021-04-08T18:12 9m20s Dist command failed to produce a tarball: cp: cannot stat './ChangeLog': No such file or directory
xmedcon fresh-snapshots 2021-04-05T08:58 3m20s Dist command failed to produce a tarball: configure.ac:31: error: Autoconf version 2.70 or higher is required
xml2 fresh-snapshots 2021-04-05T02:40 26m11s Dist command failed to produce a tarball: make[4]: *** No rule to make target 'libxml2.py', needed by 'distdir-am'. Stop.
xorgxrdp fresh-snapshots 2021-04-24T03:53 5m10s Dist command failed to produce a tarball: configure: error: please install libssl-dev or openssl-devel
xosview fresh-snapshots 2021-04-09T20:14 2m47s Dist command failed to produce a tarball: make: *** [Makefile:140: dist] Error 128
xpa-upstream debianize 2021-03-23T19:32 17s
yt-upstream debianize 2021-03-23T19:36 15m43s Broken apt packages: command line argument : Depends: python3-numpy (= 1.13.3) but 1:1.19.5-1 is to be installed
z3 fresh-snapshots 2021-04-24T08:35 28m40s Dist command failed to produce a tarball: 'python' not found. Try to set the environment variable PYTHON.
zalign-upstream debianize 2021-05-03T17:52 21h11m Dist command failed to produce a tarball: E: Failed to execute “eatmydata”: No such file or directory
zam-plugins fresh-snapshots 2021-04-24T00:46 14m59s Dist command failed to produce a tarball: make: *** [Makefile:78: .version] Error 128
zsh fresh-snapshots 2021-03-24T21:52 53m30s Dist command failed: Dist command failed to produce a tarball: configure: error: no controlling tty