History

For what's coming up, see the queue.

Last 100 runs:

Package Suite Worker Duration Result Summary
libdata-random-perl lintian-fixes osuosl167 10m37s success
libacme-eyedrops-perl lintian-fixes osuosl167 8m38s success
libdigest-md4-perl lintian-fixes osuosl167 8m51s success
libanyevent-http-scopedclient-perl lintian-fixes osuosl167 8m36s success
libapp-rad-perl lintian-fixes osuosl167 7m14s success
libarray-utils-perl lintian-fixes osuosl167 8m5s success
libalgorithm-combinatorics-perl lintian-fixes osuosl167 7m42s success
libtap-formatter-html-perl lintian-fixes osuosl167 7m1s success
libtemplate-autofilter-perl lintian-fixes osuosl167 7m5s success
libtemplate-plugin-calendar-simple-perl lintian-fixes osuosl167 3m55s build-failed-stage-build Failed 1/5 test programs. 1/3 subtests failed.
libtemplate-plugin-class-perl lintian-fixes osuosl167 5m30s success
smplayer lintian-fixes osuosl167 31m58s worker-exception IncompleteRead(76 bytes read)
imagemagick lintian-fixes osuosl167 6m56s worker-exception IncompleteRead(0 bytes read)
gnupg2 lintian-fixes osuosl167 7m45s worker-exception IncompleteRead(0 bytes read)
shadow lintian-fixes osuosl167 25m31s nothing-new-to-do no fixers to apply
googletest lintian-fixes osuosl167 41m9s result-push-failed Failed to push result branch: IncompleteRead(0 bytes read)
openssl lintian-fixes osuosl167 8m22s worker-exception IncompleteRead(0 bytes read)
ifupdown lintian-fixes osuosl167 11m43s nothing-new-to-do no fixers to apply
gtkmm2.4 lintian-fixes osuosl167 31m38s worker-exception IncompleteRead(49580 bytes read)
telepathy-gabble lintian-fixes osuosl167 32m6s worker-exception IncompleteRead(150 bytes read)
libtemplate-plugin-clickable-email-perl lintian-fixes osuosl167 8m13s success
libtemplate-plugin-comma-perl lintian-fixes osuosl167 8m0s success
sudo lintian-fixes osuosl167 31m55s worker-exception IncompleteRead(5418 bytes read)
iso-codes lintian-fixes osuosl167 6m51s worker-exception IncompleteRead(0 bytes read)
libtemplate-plugin-datetime-format-perl lintian-fixes osuosl167 9m17s success
libtemplate-plugin-html-strip-perl lintian-fixes osuosl167 8m19s success
libtemplate-plugin-json-escape-perl lintian-fixes osuosl167 8m23s success
gradle-completion lintian-fixes osuosl167 2m13s nothing-new-to-do no fixers to apply
ntp lintian-fixes osuosl167 14m11s nothing-new-to-do no fixers to apply
libtemplate-plugin-stash-perl lintian-fixes osuosl167 12m4s success
libtemplate-plugin-textile2-perl lintian-fixes osuosl167 11m45s success
pam-wrapper unchanged osuosl167 14m40s success
libterm-progressbar-quiet-perl lintian-fixes osuosl167 8m53s success
restinio unchanged osuosl167 19m44s success
libterm-progressbar-simple-perl lintian-fixes osuosl167 8m30s success
pam-wrapper lintian-fixes osuosl167 9m46s success
net-snmp lintian-fixes osuosl167 10m53s nothing-new-to-do no fixers to apply
mdevctl lintian-fixes osuosl167 6m11s build-failed-stage-explain-bd-uninstallable Sub-process /usr/bin/dpkg returned an error code (1)
restinio lintian-fixes osuosl167 20m51s success
sachesi unchanged osuosl167 18m29s success
libterm-sk-perl lintian-fixes osuosl167 11m1s success
autogen multiarch-fixes osuosl167 12m36s nothing-new-to-do no hints to apply
sachesi lintian-fixes osuosl167 19m10s success
libterm-twiddle-perl lintian-fixes osuosl167 9m23s success
libtest-carp-perl lintian-fixes osuosl167 10m2s success
libtest-class-most-perl lintian-fixes osuosl167 8m25s result-push-failed Failed to push result branch: IncompleteRead(0 bytes read)
libtest-command-perl lintian-fixes osuosl167 8m24s success
alembic unchanged osuosl167 17m49s build-failed-stage-build AssertionError: Exception CommandError('Error executing editor (file not found)') was correctly raised but did not set a cause, within context OSError('file not found') as its cause.
pyfribidi unchanged osuosl167 5m27s build-failed-stage-build FAIL: testNoReorderNonSpacingMarks (test_pyfribidi.UTF8Tests)
pytds unchanged osuosl167 6m2s build-failed-stage-build TypeError: Missing required parameter 'digestmod'.
libtest-command-simple-perl lintian-fixes osuosl167 9m27s success
libtest-consistentversion-perl lintian-fixes osuosl167 8m56s success
libtest-cpan-meta-perl unchanged osuosl167 9m30s success
dynare unchanged osuosl167 1h13m build-failed-stage-build dh_auto_build: error: make -j32 all pdf html returned exit code 2
libtest-cpan-meta-json-perl lintian-fixes osuosl167 8m14s success
libtest-cpan-meta-perl lintian-fixes osuosl167 9m16s success
libtest-cpan-meta-yaml-perl lintian-fixes osuosl167 9m3s success
supysonic unchanged osuosl167 9m54s build-failed-stage-build FAILED (errors=12)
python-gitdb unchanged osuosl167 3m31s install-deps-unsatisfied-dependencies Unsatisfied dependencies: python-smmap:amd64 (> 2)
geoalchemy2 unchanged osuosl167 4m36s install-deps-unsatisfied-dependencies Unsatisfied dependencies: postgresql-11-postgis-2.5:amd64
libtest-distribution-perl lintian-fixes osuosl167 9m54s success
libfiu unchanged osuosl167 8m44s build-failed-stage-build make[3]: *** [Makefile:96: py-run-test-wildcards] Error 1
python-pint unchanged osuosl167 11m25s build-failed-stage-build TypeError: 'NoneType' object is not callable
python-libnacl unchanged osuosl167 3m10s install-deps-unsatisfied-dependencies Unsatisfied dependencies: libpython2-stdlib:amd64 (= 2.7.17-2)
libtest-email-perl lintian-fixes osuosl167 8m39s success
libtest-exit-perl lintian-fixes osuosl167 8m31s success
libtest-files-perl lintian-fixes osuosl167 8m23s success
libtest-hasversion-perl lintian-fixes osuosl167 8m0s success
eximdoc4 unchanged osuosl167 1m40s unable-to-find-upstream-tarball Unable to find the needed upstream tarball for eximdoc4, version 4.93.0.3.
libtest-identity-perl lintian-fixes osuosl167 8m53s success
libtest-json-perl lintian-fixes osuosl167 9m51s success
libtest-log4perl-perl lintian-fixes osuosl167 9m40s success
libtest-longstring-perl lintian-fixes osuosl167 8m35s success
libtest-nowarnings-perl lintian-fixes osuosl167 8m40s success
libtest-perl-critic-progressive-perl lintian-fixes osuosl167 9m4s success
pythonmagick unchanged osuosl167 16m2s build-missing-library missing library: -lboost_python38
libtest-pod-no404s-perl lintian-fixes osuosl167 5m53s success
libtest-reporter-perl lintian-fixes osuosl167 7m41s success
libtest-sharedfork-perl lintian-fixes osuosl167 6m46s success
fava unchanged osuosl167 17m52s worker-exception Tree transform is malformed [('unversioned executability', 'new-287'), ('unversioned executability', 'new-291'), ('unversioned executability', 'new-294'), ('unversioned executability', 'new-297'), ('unversioned executability', 'new-300'), ('unversioned executability', 'new-305'), ('unversioned executability', 'new-311'), ('unversioned executability', 'new-316'), ('unversioned executability', 'new-321'), ('unversioned executability', 'new-324'), ('unversioned executability', 'new-327'), ('unversioned executability', 'new-330'), ('unversioned executability', 'new-334'), ('unversioned executability', 'new-337'), ('unversioned executability', 'new-340'), ('unversioned executability', 'new-343'), ('unversioned executability', 'new-347'), ('unversioned executability', 'new-350'), ('unversioned executability', 'new-354'), ('unversioned executability', 'new-358'), ('unversioned executability', 'new-361'), ('unversioned executability', 'new-364'), ('unversioned executability', 'new-367'), ('unversioned executability', 'new-370'), ('unversioned executability', 'new-373'), ('unversioned executability', 'new-381'), ('unversioned executability', 'new-384'), ('unversioned executability', 'new-387'), ('unversioned executability', 'new-392'), ('unversioned executability', 'new-395'), ('unversioned executability', 'new-398'), ('unversioned executability', 'new-401'), ('unversioned executability', 'new-404'), ('unversioned executability', 'new-407'), ('unversioned executability', 'new-410'), ('unversioned executability', 'new-413'), ('unversioned executability', 'new-417'), ('unversioned executability', 'new-420'), ('unversioned executability', 'new-425'), ('unversioned executability', 'new-428'), ('unversioned executability', 'new-431'), ('unversioned executability', 'new-491'), ('unversioned executability', 'new-494'), ('unversioned executability', 'new-497'), ('unversioned executability', 'new-500'), ('unversioned executability', 'new-540')]
asio unchanged osuosl167 30m56s worker-exception IncompleteRead(1188 bytes read)
libtest-weaken-perl lintian-fixes osuosl167 8m39s success
libtext-affixes-perl lintian-fixes osuosl167 9m28s success
openvas-libraries unchanged osuosl167 15m7s success
libtext-brew-perl lintian-fixes osuosl167 6m30s success
libtext-dhcpleases-perl lintian-fixes osuosl167 7m12s success
libtext-greeking-perl lintian-fixes osuosl167 7m14s success
libtext-levenshtein-damerau-perl lintian-fixes osuosl167 6m38s success
libtext-tabulardisplay-perl lintian-fixes osuosl167 9m11s success
libtext-textile-perl lintian-fixes osuosl167 9m36s success
unbound unchanged osuosl167 38m9s success
python-future unchanged osuosl167 13m17s build-failed-stage-build E: pybuild pybuild:352: test: plugin distutils failed with: exit code=1: cd /<<PKGBUILDDIR>>/.pybuild/cpython3_3.9_future/build; python3.9 -m pytest -k 'not urllib and not test_remove_hooks_then_requests and not test_requests_cm and not test_pow'
libtext-typography-perl lintian-fixes osuosl167 7m41s success
libtext-unicode-equivalents-perl lintian-fixes osuosl167 7m38s success
libtext-vfile-asdata-perl lintian-fixes osuosl167 8m11s success
libthrowable-perl lintian-fixes osuosl167 7m7s success
libtie-cache-perl lintian-fixes osuosl167 8m48s success
libtie-cphash-perl lintian-fixes osuosl167 9m11s success
libtie-dxhash-perl lintian-fixes osuosl167 9m20s success
libtext-wrapper-perl lintian-fixes osuosl167 9m3s success