uscan-error

Running uscan to download the upstream source tarball failed.

This is usually a problem with the debian/watch file.

Package Suite Start Time Duration Description
android-platform-art fresh-releases 2020-12-27T05:05 4h10m UScan failed to run: uscan error: Could not read /home/janitor/tmp/tmp30_6ig67/container/https://android.googlesource.android-platform-art-11.0.0_r25.tar.gz: No such file or directory.
android-platform-external-libselinux fresh-releases 2021-03-28T12:02 48s UScan failed to run: uscan error: Could not read /tmp/tmpa6pf01uq/container/https://android.googlesource.android-platform-external-libselinux-11.0.0_r33.tar.gz: No such file or directory.
android-platform-external-libunwind fresh-releases 2021-03-29T03:13 1m48s UScan failed to run: uscan error: Could not read /home/janitor/tmp/tmpnzybi3d7/container/https://android.googlesource.android-platform-external-libunwind-11.0.0_r33.tar.gz: No such file or directory.
android-platform-external-rappor fresh-releases 2021-03-29T05:35 15s UScan failed to run: uscan error: Could not read /home/janitor/tmp/tmpuv_q9kox/container/https://android.googlesource.android-platform-external-rappor-11.0.0_r33.tar.gz: No such file or directory.
android-platform-libcore fresh-releases 2021-04-22T06:17 1m44s UScan failed to run: uscan error: Could not read /tmp/tmprk298p5o/container/https://android.googlesource.android-platform-libcore-11.0.0_r35.tar.gz: No such file or directory.
android-platform-system-tools-hidl fresh-releases 2021-03-28T09:35 24s UScan failed to run: uscan error: Could not read /tmp/tmp28jb3lq5/container/https://android.googlesource.android-platform-system-tools-hidl-11.0.0_r33.tar.gz: No such file or directory.
android-platform-tools-apksig fresh-releases 2021-03-07T09:16 44s UScan failed to run: uscan error: Could not read /tmp/tmpdexwalzw/container/https://android.googlesource.android-platform-tools-apksig-30.0.5.tar.gz: No such file or directory.
apache-directory-jdbm fresh-releases 2020-08-30T18:49 19s UScan failed to run: uscan error: Parameter /home/janitor/tmp/tmpz670hvl_/container/2.0.0-M3 does not look like a tar archive or a zip file. .
apngasm fresh-releases 2020-08-30T21:27 56s UScan failed to run: uscan error: Could not read /home/janitor/tmp/tmpzajv4oxd/container//watch/sf.php/apngasm/apngasm-2.91.zip: No such file or directory .
apngdis fresh-releases 2020-08-30T21:35 27s UScan failed to run: uscan error: Could not read /tmp/tmpjmuqces3/container//watch/sf.php/apngdis/apngdis-2.9.zip: No such file or directory .
apngopt fresh-releases 2021-01-30T12:32 2m41s UScan failed to run: uscan error: Could not read /home/janitor/tmp/tmp71ohxxyx/container/https://qa.debian.org/watch/sf.php/apng/apngopt-1.4.zip: No such file or directory.
babel-minify fresh-releases 2021-03-29T02:50 42s UScan failed to run: unrecognized option dversionmangle=.
blastem fresh-releases 2020-12-25T23:34 21s UScan failed to run: FAIL Checking OpenPGP signature (no signature file downloaded). .
boinc-app-eah-brp fresh-releases 2020-08-30T19:31 25s UScan failed to run: In watchfile /home/janitor/tmp/tmp29m58m7q/debian/watch, reading webpage https://einsteinathome.org/download/brp-src-release.html failed: 404 Not Found.
bornagain fresh-releases 2021-03-12T01:07 34m40s UScan failed to run: In watchfile /tmp/tmpzvfaomyv/debian/watch, reading webpage http://apps.jcns.fz-juelich.de/src/BornAgain/ failed: 404 Not Found.
btrfs-progs fresh-releases 2020-08-23T02:52 1m40s UScan failed to run: FAIL Checking OpenPGP signature (no signature file downloaded). .
byte-buddy fresh-releases 2020-08-30T19:11 5m59s UScan failed to run: tar: byte-buddy-byte-buddy-1.10.14/byte-buddy-gradle-plugin/gradlew.bat: Not found in archive tar: byte-buddy-byte-buddy-1.10.14/byte-buddy-gradle-plugin/gradlew: Not found in archive tar: byte-buddy-byte-buddy-1.10.14/byte-buddy-gradle-plugin/gradle/6.0.1/gradle-wrapper.properties: Not found in archive tar: byte-buddy-byte-buddy-1.10.14/byte-buddy-gradle-plugin/gradle/6.0.1/gradle-wrapper.jar: Not found in archive tar: byte-buddy-byte-buddy-1.10.14/byte-buddy-gradle-plugin/gradle/6.0.1/gradle-6.0.1-bin.zip: Not found in archive tar: byte-buddy-byte-buddy-1.10.14/byte-buddy-gradle-plugin/gradle/2.14.1/gradle-wrapper.properties: Not found in archive tar: byte-buddy-byte-buddy-1.10.14/byte-buddy-gradle-plugin/gradle/2.14.1/gradle-wrapper.jar: Not found in archive tar: byte-buddy-byte-buddy-1.10.14/byte-buddy-gradle-plugin/gradle/2.14.1/gradle-2.14.1-bin.zip: Not found in archive tar: byte-buddy-byte-buddy-1.10.14/byte-buddy-dep/src/test/resources/net/bytebuddy/test/precompiled/TypeVariableInterfaceBridgeBase.class: Not found in archive tar: byte-buddy-byte-buddy-1.10.14/byte-buddy-dep/src/test/resources/net/bytebuddy/test/precompiled/TypeVariableInterfaceBridge.class: Not found in archive tar: byte-buddy-byte-buddy-1.10.14/byte-buddy-dep/src/test/resources/net/bytebuddy/test/precompiled/TypeConstantSample.class: Not found in archive tar: byte-buddy-byte-buddy-1.10.14/byte-buddy-dep/src/test/resources/net/bytebuddy/test/precompiled/TypeAnnotationSamples.class: Not found in archive tar: byte-buddy-byte-buddy-1.10.14/byte-buddy-dep/src/test/resources/net/bytebuddy/test/precompiled/TypeAnnotationOtherSamples.class: Not found in archive tar: byte-buddy-byte-buddy-1.10.14/byte-buddy-dep/src/test/resources/net/bytebuddy/test/precompiled/TypeAnnotationOtherSamples$Qux.class: Not found in archive tar: byte-buddy-byte-buddy-1.10.14/byte-buddy-dep/src/test/resources/net/bytebuddy/test/precompiled/TypeAnnotationOtherSamples$Qux$Baz.class: Not found in archive tar: byte-buddy-byte-buddy-1.10.14/byte-buddy-dep/src/test/resources/net/bytebuddy/test/precompiled/TypeAnnotationOtherSamples$Bar.class: Not found in archive tar: byte-buddy-byte-buddy-1.10.14/byte-buddy-dep/src/test/resources/net/bytebuddy/test/precompiled/TypeAnnotation.class: Not found in archive tar: byte-buddy-byte-buddy-1.10.14/byte-buddy-dep/src/test/resources/net/bytebuddy/test/precompiled/SingleDefaultMethodPreferringInterceptor.class: Not found in archive tar: byte-buddy-byte-buddy-1.10.14/byte-buddy-dep/src/test/resources/net/bytebuddy/test/precompiled/SingleDefaultMethodNonOverridingInterface.class: Not found in archive tar: byte-buddy-byte-buddy-1.10.14/byte-buddy-dep/src/test/resources/net/bytebuddy/test/precompiled/SingleDefaultMethodInterface.class: Not found in archive tar: byte-buddy-byte-buddy-1.10.14/byte-buddy-dep/src/test/resources/net/bytebuddy/test/precompiled/SingleDefaultMethodConflictingPreferringInterceptor.class: Not found in archive tar: byte-buddy-byte-buddy-1.10.14/byte-buddy-dep/src/test/resources/net/bytebuddy/test/precompiled/SingleDefaultMethodConflictingInterface.class: Not found in archive tar: byte-buddy-byte-buddy-1.10.14/byte-buddy-dep/src/test/resources/net/bytebuddy/test/precompiled/SingleDefaultMethodClass.class: Not found in archive tar: byte-buddy-byte-buddy-1.10.14/byte-buddy-dep/src/test/resources/net/bytebuddy/test/precompiled/SimpleTypeAnnotatedType.class: Not found in archive tar: byte-buddy-byte-buddy-1.10.14/byte-buddy-dep/src/test/resources/net/bytebuddy/test/precompiled/SampleRecord.class: Not found in archive tar: byte-buddy-byte-buddy-1.10.14/byte-buddy-dep/src/test/resources/net/bytebuddy/test/precompiled/ReturnTypeInterfaceBridgeBase.class: Not found in archive tar: byte-buddy-byte-buddy-1.10.14/byte-buddy-dep/src/test/resources/net/bytebuddy/test/precompiled/ReturnTypeInterfaceBridge.class: Not found in archive tar: byte-buddy-byte-buddy-1.10.14/byte-buddy-dep/src/test/resources/net/bytebuddy/test/precompiled/ReceiverTypeSample.class: Not found in archive tar: byte-buddy-byte-buddy-1.10.14/byte-buddy-dep/src/test/resources/net/bytebuddy/test/precompiled/ReceiverTypeSample$Nested.class: Not found in archive tar: byte-buddy-byte-buddy-1.10.14/byte-buddy-dep/src/test/resources/net/bytebuddy/test/precompiled/ReceiverTypeSample$Inner.class: Not found in archive tar: byte-buddy-byte-buddy-1.10.14/byte-buddy-dep/src/test/resources/net/bytebuddy/test/precompiled/ReceiverTypeSample$Generic.class: Not found in archive tar: byte-buddy-byte-buddy-1.10.14/byte-buddy-dep/src/test/resources/net/bytebuddy/test/precompiled/ReceiverTypeSample$Generic$Nested.class: Not found in archive tar: byte-buddy-byte-buddy-1.10.14/byte-buddy-dep/src/test/resources/net/bytebuddy/test/precompiled/ReceiverTypeSample$Generic$Inner.class: Not found in archive tar: byte-buddy-byte-buddy-1.10.14/byte-buddy-dep/src/test/resources/net/bytebuddy/test/precompiled/ParameterNames.class: Not found in archive tar: byte-buddy-byte-buddy-1.10.14/byte-buddy-dep/src/test/resources/net/bytebuddy/test/precompiled/OtherTypeAnnotation.class: Not found in archive tar: byte-buddy-byte-buddy-1.10.14/byte-buddy-dep/src/test/resources/net/bytebuddy/test/precompiled/OriginMethodType.class: Not found in archive tar: byte-buddy-byte-buddy-1.10.14/byte-buddy-dep/src/test/resources/net/bytebuddy/test/precompiled/OriginMethodHandle.class: Not found in archive tar: byte-buddy-byte-buddy-1.10.14/byte-buddy-dep/src/test/resources/net/bytebuddy/test/precompiled/OriginExecutableWithCache.class: Not found in archive tar: byte-buddy-byte-buddy-1.10.14/byte-buddy-dep/src/test/resources/net/bytebuddy/test/precompiled/OriginExecutable.class: Not found in archive tar: byte-buddy-byte-buddy-1.10.14/byte-buddy-dep/src/test/resources/net/bytebuddy/test/precompiled/MorphDefaultInterface.class: Not found in archive tar: byte-buddy-byte-buddy-1.10.14/byte-buddy-dep/src/test/resources/net/bytebuddy/test/precompiled/MorphDefaultDelegationTargetImplicit.class: Not found in archive tar: byte-buddy-byte-buddy-1.10.14/byte-buddy-dep/src/test/resources/net/bytebuddy/test/precompiled/MorphDefaultDelegationTargetExplicit.class: Not found in archive tar: byte-buddy-byte-buddy-1.10.14/byte-buddy-dep/src/test/resources/net/bytebuddy/test/precompiled/LegacyInterface.class: Not found in archive tar: byte-buddy-byte-buddy-1.10.14/byte-buddy-dep/src/test/resources/net/bytebuddy/test/precompiled/LambdaSampleFactory.class: Not found in archive tar: byte-buddy-byte-buddy-1.10.14/byte-buddy-dep/src/test/resources/net/bytebuddy/test/precompiled/DynamicInvokeBootstrap.class: Not found in archive tar: byte-buddy-byte-buddy-1.10.14/byte-buddy-dep/src/test/resources/net/bytebuddy/test/precompiled/DynamicInvokeBootstrap$SampleEnum.class: Not found in archive tar: byte-buddy-byte-buddy-1.10.14/byte-buddy-dep/src/test/resources/net/bytebuddy/test/precompiled/DynamicConstantBootstrap.class: Not found in archive tar: byte-buddy-byte-buddy-1.10.14/byte-buddy-dep/src/test/resources/net/bytebuddy/test/precompiled/DelegationDefaultTargetSerializable.class: Not found in archive tar: byte-buddy-byte-buddy-1.10.14/byte-buddy-dep/src/test/resources/net/bytebuddy/test/precompiled/DelegationDefaultTargetExplicit.class: Not found in archive tar: byte-buddy-byte-buddy-1.10.14/byte-buddy-dep/src/test/resources/net/bytebuddy/test/precompiled/DelegationDefaultTarget.class: Not found in archive tar: byte-buddy-byte-buddy-1.10.14/byte-buddy-dep/src/test/resources/net/bytebuddy/test/precompiled/DelegationDefaultInterface.class: Not found in archive tar: byte-buddy-byte-buddy-1.10.14/byte-buddy-dep/src/test/resources/net/bytebuddy/test/precompiled/AdviceBootstrap.class: Not found in archive tar: Exiting with failure status due to previous errors uscan: error: tar --delete byte-buddy-byte-buddy-1.10.14/byte-buddy-gradle-plugin/gradlew.bat byte-buddy-byte-buddy-1.10.14/byte-buddy-gradle-plugin/gradlew byte-buddy-byte-buddy-1.10.14/byte-buddy-gradle-plugin/gradle/6.0.1/gradle-wrapper.properties byte-buddy-byte-buddy-1.10.14/byte-buddy-gradle-plugin/gradle/6.0.1/gradle-wrapper.jar byte-buddy-byte-buddy-1.10.14/byte-buddy-gradle-plugin/gradle/6.0.1/gradle-6.0.1-bin.zip byte-buddy-byte-buddy-1.10.14/byte-buddy-gradle-plugin/gradle/2.14.1/gradle-wrapper.properties byte-buddy-byte-buddy-1.10.14/byte-buddy-gradle-plugin/gradle/2.14.1/gradle-wrapper.jar byte-buddy-byte-buddy-1.10.14/byte-buddy-gradle-plugin/gradle/2.14.1/gradle-2.14.1-bin.zip byte-buddy-byte-buddy-1.10.14/byte-buddy-dep/src/test/resources/net/bytebuddy/test/precompiled/TypeVariableInterfaceBridgeBase.class byte-buddy-byte-buddy-1.10.14/byte-buddy-dep/src/test/resources/net/bytebuddy/test/precompiled/TypeVariableInterfaceBridge.class byte-buddy-byte-buddy-1.10.14/byte-buddy-dep/src/test/resources/net/bytebuddy/test/precompiled/TypeConstantSample.class byte-buddy-byte-buddy-1.10.14/byte-buddy-dep/src/test/resources/net/bytebuddy/test/precompiled/TypeAnnotationSamples.class byte-buddy-byte-buddy-1.10.14/byte-buddy-dep/src/test/resources/net/bytebuddy/test/precompiled/TypeAnnotationOtherSamples.class byte-buddy-byte-buddy-1.10.14/byte-buddy-dep/src/test/resources/net/bytebuddy/test/precompiled/TypeAnnotationOtherSamples$Qux.class byte-buddy-byte-buddy-1.10.14/byte-buddy-dep/src/test/resources/net/bytebuddy/test/precompiled/TypeAnnotationOtherSamples$Qux$Baz.class byte-buddy-byte-buddy-1.10.14/byte-buddy-dep/src/test/resources/net/bytebuddy/test/precompiled/TypeAnnotationOtherSamples$Bar.class byte-buddy-byte-buddy-1.10.14/byte-buddy-dep/src/test/resources/net/bytebuddy/test/precompiled/TypeAnnotation.class byte-buddy-byte-buddy-1.10.14/byte-buddy-dep/src/test/resources/net/bytebuddy/test/precompiled/SingleDefaultMethodPreferringInterceptor.class byte-buddy-byte-buddy-1.10.14/byte-buddy-dep/src/test/resources/net/bytebuddy/test/precompiled/SingleDefaultMethodNonOverridingInterface.class byte-buddy-byte-buddy-1.10.14/byte-buddy-dep/src/test/resources/net/bytebuddy/test/precompiled/SingleDefaultMethodInterface.class byte-buddy-byte-buddy-1.10.14/byte-buddy-dep/src/test/resources/net/bytebuddy/test/precompiled/SingleDefaultMethodConflictingPreferringInterceptor.class byte-buddy-byte-buddy-1.10.14/byte-buddy-dep/src/test/resources/net/bytebuddy/test/precompiled/SingleDefaultMethodConflictingInterface.class byte-buddy-byte-buddy-1.10.14/byte-buddy-dep/src/test/resources/net/bytebuddy/test/precompiled/SingleDefaultMethodClass.class byte-buddy-byte-buddy-1.10.14/byte-buddy-dep/src/test/resources/net/bytebuddy/test/precompiled/SimpleTypeAnnotatedType.class byte-buddy-byte-buddy-1.10.14/byte-buddy-dep/src/test/resources/net/bytebuddy/test/precompiled/SampleRecord.class byte-buddy-byte-buddy-1.10.14/byte-buddy-dep/src/test/resources/net/bytebuddy/test/precompiled/ReturnTypeInterfaceBridgeBase.class byte-buddy-byte-buddy-1.10.14/byte-buddy-dep/src/test/resources/net/bytebuddy/test/precompiled/ReturnTypeInterfaceBridge.class byte-buddy-byte-buddy-1.10.14/byte-buddy-dep/src/test/resources/net/bytebuddy/test/precompiled/ReceiverTypeSample.class byte-buddy-byte-buddy-1.10.14/byte-buddy-dep/src/test/resources/net/bytebuddy/test/precompiled/ReceiverTypeSample$Nested.class byte-buddy-byte-buddy-1.10.14/byte-buddy-dep/src/test/resources/net/bytebuddy/test/precompiled/ReceiverTypeSample$Inner.class byte-buddy-byte-buddy-1.10.14/byte-buddy-dep/src/test/resources/net/bytebuddy/test/precompiled/ReceiverTypeSample$Generic.class byte-buddy-byte-buddy-1.10.14/byte-buddy-dep/src/test/resources/net/bytebuddy/test/precompiled/ReceiverTypeSample$Generic$Nested.class byte-buddy-byte-buddy-1.10.14/byte-buddy-dep/src/test/resources/net/bytebuddy/test/precompiled/ReceiverTypeSample$Generic$Inner.class byte-buddy-byte-buddy-1.10.14/byte-buddy-dep/src/test/resources/net/bytebuddy/test/precompiled/ParameterNames.class byte-buddy-byte-buddy-1.10.14/byte-buddy-dep/src/test/resources/net/bytebuddy/test/precompiled/OtherTypeAnnotation.class byte-buddy-byte-buddy-1.10.14/byte-buddy-dep/src/test/resources/net/bytebuddy/test/precompiled/OriginMethodType.class byte-buddy-byte-buddy-1.10.14/byte-buddy-dep/src/test/resources/net/bytebuddy/test/precompiled/OriginMethodHandle.class byte-buddy-byte-buddy-1.10.14/byte-buddy-dep/src/test/resources/net/bytebuddy/test/precompiled/OriginExecutableWithCache.class byte-buddy-byte-buddy-1.10.14/byte-buddy-dep/src/test/resources/net/bytebuddy/test/precompiled/OriginExecutable.class byte-buddy-byte-buddy-1.10.14/byte-buddy-dep/src/test/resources/net/bytebuddy/test/precompiled/MorphDefaultInterface.class byte-buddy-byte-buddy-1.10.14/byte-buddy-dep/src/test/resources/net/bytebuddy/test/precompiled/MorphDefaultDelegationTargetImplicit.class byte-buddy-byte-buddy-1.10.14/byte-buddy-dep/src/test/resources/net/bytebuddy/test/precompiled/MorphDefaultDelegationTargetExplicit.class byte-buddy-byte-buddy-1.10.14/byte-buddy-dep/src/test/resources/net/bytebuddy/test/precompiled/LegacyInterface.class byte-buddy-byte-buddy-1.10.14/byte-buddy-dep/src/test/resources/net/bytebuddy/test/precompiled/LambdaSampleFactory.class byte-buddy-byte-buddy-1.10.14/byte-buddy-dep/src/test/resources/net/bytebuddy/test/precompiled/DynamicInvokeBootstrap.class byte-buddy-byte-buddy-1.10.14/byte-buddy-dep/src/test/resources/net/bytebuddy/test/precompiled/DynamicInvokeBootstrap$SampleEnum.class byte-buddy-byte-buddy-1.10.14/byte-buddy-dep/src/test/resources/net/bytebuddy/test/precompiled/DynamicConstantBootstrap.class byte-buddy-byte-buddy-1.10.14/byte-buddy-dep/src/test/resources/net/bytebuddy/test/precompiled/DelegationDefaultTargetSerializable.class byte-buddy-byte-buddy-1.10.14/byte-buddy-dep/src/test/resources/net/bytebuddy/test/precompiled/DelegationDefaultTargetExplicit.class byte-buddy-byte-buddy-1.10.14/byte-buddy-dep/src/test/resources/net/bytebuddy/test/precompiled/DelegationDefaultTarget.class byte-buddy-byte-buddy-1.10.14/byte-buddy-dep/src/test/resources/net/bytebuddy/test/precompiled/DelegationDefaultInterface.class byte-buddy-byte-buddy-1.10.14/byte-buddy-dep/src/test/resources/net/bytebuddy/test/precompiled/AdviceBootstrap.class byte-buddy-byte-buddy-1.10.14/.mvn/release.settings.xml byte-buddy-byte-buddy-1.10.14/.mvn/nossl.settings.xml byte-buddy-byte-buddy-1.10.14/.mvn/A1039E8B.asc byte-buddy-byte-buddy-1.10.14/.mvn/3.2.5/maven-wrapper.properties byte-buddy-byte-buddy-1.10.14/.mvn/3.2.5/maven-wrapper.jar byte-buddy-byte-buddy-1.10.14/.mvn/3.2.5/apache-maven-3.2.5-bin.zip byte-buddy-byte-buddy-1.10.14/.mvn/3.2.5/ byte-buddy-byte-buddy-1.10.14/.mvn/ subprocess returned exit status 2 .
castor fresh-releases 2020-10-10T04:15 54s UScan failed to run: mv: cannot stat 'castor-1.3.2': No such file or directory.
cdist fresh-releases 2021-03-07T10:58 2m31s UScan failed to run: In watchfile debian/watch, reading webpage https://code.ungleich.ch/ungleich-public/cdist/tags failed: 500 read timeout.
cdo fresh-releases 2020-12-01T01:30 7m34s UScan failed to run: uscan error: Unknown compression used in /home/janitor/tmp/tmp33gb44c5/container/cdo-1.9.10rc2.tar.gz.
citation-style-language-styles fresh-releases 2021-01-19T13:41 15m11s UScan failed to run: remote: Not Found.
cl-fad fresh-releases 2020-12-25T16:51 24s UScan failed to run: remote: Not Found.
clhep fresh-releases 2020-08-30T18:14 32s UScan failed to run: --2020-08-30 18:14:58-- http://proj-clhep.web.cern.ch/proj-clhep/DISTRIBUTION/tarFiles/clhep-2.2.0.8+dfsg.tgz Resolving proj-clhep.web.cern.ch (proj-clhep.web.cern.ch)... 137.138.150.3, 2001:1458:d00:12::2c7 Connecting to proj-clhep.web.cern.ch (proj-clhep.web.cern.ch)|137.138.150.3|:80... connected. HTTP request sent, awaiting response... 404 Not Found 2020-08-30 18:14:58 ERROR 404: Not Found. uscan: error: ./debian/get-orig-source --upstream-version 2.2.0.8+dfsg /home/janitor/tmp/tmp4kusl_3k/container/clhep_2.2.0.8+dfsg.orig.tar.xz subprocess returned exit status 8 .
cl-interpol fresh-releases 2020-11-28T11:17 19s UScan failed to run: remote: Not Found.
clipit fresh-releases 2020-12-15T09:41 9s UScan failed to run: remote: Not Found.
cl-named-readtables fresh-releases 2020-12-26T13:17 9s UScan failed to run: remote: Not Found.
closure-compiler fresh-releases 2021-01-25T19:28 16m7s UScan failed to run: Can't exec "jh_repack": No such file or directory at /usr/share/perl5/Dpkg/IPC.pm line 311..
cloud-utils fresh-releases 2020-08-30T19:43 36s UScan failed to run: FAIL Checking OpenPGP signature (no signature file downloaded). .
continuity fresh-releases 2020-11-28T11:40 25s UScan failed to run: remote: Not Found.
cpl-plugin-amber fresh-releases 2020-08-30T21:04 4m45s UScan failed to run: In directory ., downloading ftp://ftp.eso.org/pub/dfs/pipelines/instruments/amber/amber-kit-4.4.0.tar.gz failed: 404 File 'amber-kit-4.4.0.tar.gz' not found.
cpl-plugin-fors fresh-releases 2020-08-30T20:59 5m4s UScan failed to run: In directory ., downloading ftp://ftp.eso.org/pub/dfs/pipelines/instruments/fors/fors-kit-5.5.3.tar.gz failed: 404 File 'fors-kit-5.5.3.tar.gz' not found.
cpl-plugin-giraf fresh-releases 2020-09-04T15:32 4m40s UScan failed to run: In directory ., downloading ftp://ftp.eso.org/pub/dfs/pipelines/instruments/giraffe/giraf-kit-2.16.7.tar.gz failed: 404 File 'giraf-kit-2.16.7.tar.gz' not found.
cpl-plugin-hawki fresh-releases 2020-08-30T21:14 4m45s UScan failed to run: In directory ., downloading ftp://ftp.eso.org/pub/dfs/pipelines/instruments/hawki/hawki-kit-2.4.8.tar.gz failed: 404 File 'hawki-kit-2.4.8.tar.gz' not found.
cpl-plugin-naco fresh-releases 2020-08-30T21:09 4m43s UScan failed to run: In directory ., downloading ftp://ftp.eso.org/pub/dfs/pipelines/instruments/naco/naco-kit-4.4.9.tar.gz failed: 404 File 'naco-kit-4.4.9.tar.gz' not found.
cpl-plugin-uves fresh-releases 2020-09-04T15:34 17m25s UScan failed to run: In directory ., downloading ftp://ftp.eso.org/pub/dfs/pipelines/instruments/uves/uves-kit-6.1.3.tar.gz failed: 404 File 'uves-kit-6.1.3.tar.gz' not found.
cpl-plugin-vimos fresh-releases 2020-09-04T15:31 24m58s UScan failed to run: In directory ., downloading ftp://ftp.eso.org/pub/dfs/pipelines/instruments/vimos/vimos-kit-4.1.0.tar.gz failed: 404 File 'vimos-kit-4.1.0.tar.gz' not found.
cpl-plugin-xshoo fresh-releases 2020-08-30T21:28 5m29s UScan failed to run: In directory ., downloading ftp://ftp.eso.org/pub/dfs/pipelines/instruments/xshooter/xshoo-kit-3.5.0.tar.gz failed: 404 File 'xshoo-kit-3.5.0.tar.gz' not found.
cppreference-doc fresh-releases 2020-12-26T03:57 1m35s UScan failed to run: uscan error: Unknown compression used in /tmp/tmpowg9d5i1/container/File:cppreference-doc-20190607.tar.xz.
cryptsetup fresh-releases 2020-08-23T03:11 1m50s UScan failed to run: In watch file debian/watch, reading webpage https://www.kernel.org/pub/linux/utils/cryptsetup/ failed: 500 Can't connect to mirrors.edge.kernel.org:443 (Network is unreachable).
cssparser fresh-releases 2021-01-19T16:06 58s UScan failed to run: https://qa.debian.org/watch/sf.php/cssparser/cssparser-0.9.29.jar.asc.
dacs fresh-releases 2021-01-25T06:33 2m11s UScan failed to run: In watchfile /tmp/tmp_sf5sfhz/debian/watch, reading webpage http://dacs.dss.ca/download.html failed: 500 Can't connect to dacs.dss.ca:80 (Connection timed out).
dahdi-firmware fresh-releases 2020-12-27T13:46 56s UScan failed to run: http://downloads.asterisk.org/pub/telephony/dahdi-linux/releases/dahdi-linux-3.1.0.tar.gz.asc.
darkplaces fresh-releases 2020-08-30T20:58 35s UScan failed to run: caution: not extracting; -d ignored tar: Cowardly refusing to create an empty archive Try 'tar --help' or 'tar --usage' for more information. uscan: error: tar --owner=root --group=root --mode=a+rX --create --file /home/janitor/tmp/tmpj7iba_k9/container/darkplaces_0~20180908~beta1.orig.tar --directory /home/janitor/tmp/uscanInJQ/repack subprocess returned exit status 2 .
dbtoepub fresh-releases 2020-08-30T19:10 30s UScan failed to run: uscan error: Parameter /home/janitor/tmp/tmphqgzwfrx/container/dbtoepub-dummy-r9924 does not look like a tar archive or a zip file. .
debiman fresh-releases 2020-11-30T21:02 1m24s UScan failed to run: remote: Not Found.
django-guardian fresh-releases 2020-08-30T18:58 33s UScan failed to run: FAIL Checking OpenPGP signature (no signature file downloaded). .
dlpack fresh-releases 2020-12-25T05:42 18s UScan failed to run: remote: Not Found.
dom4j fresh-releases 2020-10-31T01:04 1m45s UScan failed to run: uscan warning: In /tmp/tmp3vnzdx20/debian/watch, no matching refs for watch line https://github.com/dom4j/dom4j refs/tags/(?:dom4j_|version-)([\d\._]+).
drawing fresh-releases 2020-12-02T00:10 24s UScan failed to run: remote: Not Found.
dump1090-mutability fresh-releases 2020-08-30T19:36 26s UScan failed to run: uscan error: Could not read /tmp/tmp4jobj7o9/container//mutability/dump1090/archive/v1.15-dev.tar.gz: No such file or directory .
duperemove fresh-releases 2021-01-19T14:13 4m11s UScan failed to run: FAIL Checking OpenPGP signature (no keyring). .
ebib fresh-releases 2020-12-29T09:01 2m41s UScan failed to run: uscan warning: In /tmp/tmpki0wd0vz/debian/watch, no matching refs for watch line https://github.com/joostkremers/ebib refs/tags/([\d\.\d\.]+) debian.
eclipselink fresh-releases 2020-08-30T18:50 8m8s UScan failed to run: End-of-central-directory signature not found. Either this file is not a zipfile, or it constitutes one disk of a multi-part archive. In the latter case the central directory and zipfile comment will be found on the last disk(s) of this archive. unzip: cannot find zipfile directory in one of /home/janitor/tmp/tmpe1p2exlu/container/eclipselink_2.7.7.orig.tar.xz or /home/janitor/tmp/tmpe1p2exlu/container/eclipselink_2.7.7.orig.tar.xz.zip, and cannot find /home/janitor/tmp/tmpe1p2exlu/container/eclipselink_2.7.7.orig.tar.xz.ZIP, period. uscan: error: debian/orig-tar.sh --upstream-version 2.7.7 /home/janitor/tmp/tmpe1p2exlu/container/eclipselink_2.7.7.orig.tar.xz subprocess returned exit status 9 .
eclipse-platform-ua fresh-releases 2020-10-10T04:09 45m42s UScan failed to run: uscan warning: In /tmp/tmp59wsd00l/debian/watch, no matching refs for watch line https://github.com/eclipse/eclipse.platform.ua refs/tags/R(\d{1,2}_[\d_]+[az]?).
eclipse-wtp fresh-releases 2020-11-28T11:52 43s UScan failed to run: In directory ., downloading http://download.eclipse.org/webtools/drops/R3.19.0/R-3.19.0-20200828030223/ failed: 404 Not Found.
enemylines7 fresh-releases 2020-08-30T19:44 32s UScan failed to run: In directory ., downloading http://enelin.system397.space//enelin7-0.8.1.zip failed: 404 Not Found.
ethtool fresh-releases 2020-08-23T02:59 1m33s UScan failed to run: In directory ., downloading https://www.kernel.org/pub/software/network/ethtool/ethtool-5.8.tar.xz failed: 500 Can't connect to mirrors.edge.kernel.org:443 (Network is unreachable).
exec-maven-plugin fresh-releases 2020-12-25T11:35 17s UScan failed to run: uscan warning: In /tmp/tmp4c5rj981/debian/watch, no matching refs for watch line https://github.com/mojohaus/exec-maven-plugin refs/tags/exec-maven-plugin-([\d\.]+).
fasttree fresh-releases 2020-08-30T20:57 39s UScan failed to run: uscan error: Parameter /home/janitor/tmp/tmp_5wyiobh/container/FastTree-2.1.11.c does not look like a tar archive or a zip file. .
fcitx5 fresh-releases 2020-11-30T21:11 5m58s UScan failed to run: uscan warning: In debian/watch, no matching refs for watch line https://github.com/fcitx/fcitx5 refs/tags/(?:[-_]?(\d[\-+\.:\~\da-zA-Z]*)) debian.
fcitx5-chinese-addons fresh-releases 2020-12-01T05:45 57s UScan failed to run: uscan warning: In debian/watch, no matching refs for watch line https://github.com/fcitx/fcitx5-chinese-addons refs/tags/(?:[-_]?(\d[\-+\.:\~\da-zA-Z]*)) debian.
fcitx5-gtk fresh-releases 2020-11-29T04:47 8s UScan failed to run: uscan warning: In /tmp/tmpbfw9_3fj/debian/watch, no matching refs for watch line https://github.com/fcitx/fcitx5-gtk refs/tags/(?:[-_]?(\d[\-+\.:\~\da-zA-Z]*)) debian.
fcitx5-hangul fresh-releases 2021-01-19T18:51 20s UScan failed to run: uscan warning: In /tmp/tmp_oexc6if/debian/watch, no matching refs for watch line https://github.com/fcitx/fcitx5-hangul refs/tags/(?:[-_]?(\d[\-+\.:\~\da-zA-Z]*)) debian.
fcitx5-lua fresh-releases 2021-01-19T17:05 25s UScan failed to run: uscan warning: In /tmp/tmp3n756rc1/debian/watch, no matching refs for watch line https://github.com/fcitx/fcitx5-lua refs/tags/(?:[-_]?(\d[\-+\.:\~\da-zA-Z]*)) debian.
fcitx5-material-color fresh-releases 2021-01-19T18:41 18s UScan failed to run: uscan warning: In /tmp/tmpc8xndyk2/debian/watch, no matching refs for watch line https://github.com/hosxy/Fcitx5-Material-Color refs/tags/(?:[-_]?(\d[\-+\.:\~\da-zA-Z]*)) debian.
fcitx5-skk fresh-releases 2021-01-19T17:09 20s UScan failed to run: uscan warning: In /tmp/tmpqklw434j/debian/watch, no matching refs for watch line https://github.com/fcitx/fcitx5-skk refs/tags/(?:[-_]?(\d[\-+\.:\~\da-zA-Z]*)) debian.
fdm fresh-releases 2020-08-30T19:32 47s UScan failed to run: uscan error: Could not read /home/janitor/tmp/tmpbhha2jya/container/2.0/fdm-2.0.tar.gz: No such file or directory .
felix-gogo-command fresh-releases 2020-08-30T18:44 21s UScan failed to run: uscan error: Parameter /home/janitor/tmp/tmp1otnkojp/container/org.apache.felix.gogo.command-1.1.0 does not look like a tar archive or a zip file. .
felix-gogo-runtime fresh-releases 2020-08-30T18:59 20s UScan failed to run: uscan error: Parameter /home/janitor/tmp/tmpluif6k0o/container/org.apache.felix.gogo.runtime-1.1.2 does not look like a tar archive or a zip file. .
felix-gogo-shell fresh-releases 2020-08-30T18:14 21s UScan failed to run: uscan error: Parameter /home/janitor/tmp/tmpqisgl0q1/container/org.apache.felix.gogo.shell-1.1.2 does not look like a tar archive or a zip file. .
felix-utils fresh-releases 2020-08-30T19:05 24s UScan failed to run: uscan error: Parameter /home/janitor/tmp/tmpoe2uadtv/container/org.apache.felix.utils-1.11.4 does not look like a tar archive or a zip file. .
flask-compress fresh-releases 2020-12-26T13:09 14s UScan failed to run: FAIL Checking OpenPGP signature (no signature file downloaded). .
flexi-streams fresh-releases 2020-12-25T05:38 24s UScan failed to run: remote: Not Found.
freebsd-manpages fresh-releases 2020-12-27T10:00 4m27s UScan failed to run: uscan error: Parameter /tmp/tmplslzyycm/container/12.2-RELEASE does not look like a tar archive or a zip file..
fsvs fresh-releases 2020-08-30T18:45 23s UScan failed to run: uscan error: Could not read /home/janitor/tmp/tmpdkhd_6lg/container//phmarek/fsvs/archive/fsvs-1.2.9.tar.gz: No such file or directory .
ganymed-ssh2 fresh-releases 2020-08-30T20:58 18s UScan failed to run: In watchfile /home/janitor/tmp/tmptca9gbis/debian/watch, reading webpage http://central.maven.org/maven2/ch/ethz/ganymed/ganymed-ssh2/ failed: 500 Can't connect to central.maven.org:80 (Name or service not known).
gddrescue fresh-releases 2020-08-30T19:07 32s UScan failed to run: gpgv: Signature made Mon 02 Mar 2020 18:43:58 UTC gpgv: using DSA key 8FE99503132D7742 gpgv: Good signature from "Antonio Diaz Diaz <antonio@gnu.org>" gpgv: aka "Antonio Diaz <ant_diaz@teleline.es>" uscan error: Parameter /home/janitor/tmp/tmpgunf3k1z/container/ddrescue-1.25.tar.lz does not look like a tar archive or a zip file. .
geda-gaf fresh-releases 2020-12-27T05:49 5m24s UScan failed to run: FAIL Checking OpenPGP signature (no signature file downloaded). .
geronimo-annotation-1.3-spec fresh-releases 2020-08-30T19:18 19s UScan failed to run: uscan error: Parameter /home/janitor/tmp/tmphkfwgp_k/container/geronimo-annotation_1.3_spec-1.3 does not look like a tar archive or a zip file. .
geronimo-jacc-1.1-spec fresh-releases 2020-08-30T18:30 20s UScan failed to run: uscan error: Parameter /home/janitor/tmp/tmptbny9c3i/container/geronimo-jacc_1.1_spec-1.0.3 does not look like a tar archive or a zip file. .
gitmagic fresh-releases 2020-12-01T03:35 26s UScan failed to run: In directory ., downloading relative-time datetime="2020-01-17T failed: 400 URL must be absolute.
gnu-efi fresh-releases 2020-12-26T16:10 1m42s UScan failed to run: In directory ., downloading https://qa.debian.org/watch/sf.php/gnu-efi/gnu-efi-3.0.12.tar.bz2 failed: 500 Can't connect to pilotfiber.dl.sourceforge.net:443.
golang-blackfriday fresh-releases 2021-01-19T23:19 1m6s UScan failed to run: remote: Not Found.
golang-github-alecthomas-repr fresh-releases 2020-11-28T12:57 15s UScan failed to run: remote: Not Found.
golang-github-cilium-ebpf fresh-releases 2020-12-15T14:29 9s UScan failed to run: uscan warning: In /tmp/tmp4f41ihfp/debian/watch, no matching refs for watch line https://github.com/cilium/ebpf refs/tags/v?(?:[-_]?(\d[\-+\.:\~\da-zA-Z]*)) debian.
golang-github-containerd-fifo fresh-releases 2020-11-28T07:26 19s UScan failed to run: remote: Not Found.
golang-github-d2g-dhcp4 fresh-releases 2020-12-25T04:10 15s UScan failed to run: remote: Not Found.
golang-github-denverdino-aliyungo fresh-releases 2020-11-28T08:59 19s UScan failed to run: remote: Not Found.
golang-github-google-pprof fresh-releases 2020-11-28T09:48 1m28s UScan failed to run: remote: Not Found.
golang-github-hashicorp-go-checkpoint fresh-releases 2020-12-25T17:28 15s UScan failed to run: remote: Not Found.
golang-github-heroku-rollrus fresh-releases 2020-12-01T03:16 8s UScan failed to run: remote: Not Found.
golang-github-kardianos-osext fresh-releases 2020-12-27T03:03 1m20s UScan failed to run: remote: Not Found.
golang-github-knqyf263-go-cpe fresh-releases 2020-12-27T08:25 2m11s UScan failed to run: remote: Not Found.
golang-github-kolo-xmlrpc fresh-releases 2020-11-28T10:01 16s UScan failed to run: remote: Not Found.
golang-github-mcuadros-go-lookup fresh-releases 2021-01-19T20:28 34s UScan failed to run: remote: Not Found.
golang-github-mrunalp-fileutils fresh-releases 2020-12-26T12:41 21s UScan failed to run: uscan warning: In /tmp/tmppqr3mf4e/debian/watch, no matching refs for watch line https://github.com/mrunalp/fileutils refs/tags/v?(?:[-_]?(\d[\-+\.:\~\da-zA-Z]*)).
golang-github-opencontainers-specs fresh-releases 2020-12-25T08:56 30s UScan failed to run: remote: Not Found.
golang-github-spkg-bom fresh-releases 2020-11-30T21:35 14s UScan failed to run: remote: Not Found.
golang-go4 fresh-releases 2020-11-30T19:34 13s UScan failed to run: remote: Not Found.
golang-go.crypto fresh-releases 2020-12-26T04:07 13s UScan failed to run: remote: Not Found.
golang-golang-x-tools fresh-releases 2020-09-20T07:33 6m42s UScan failed to run: remote: Not Found.
golang-goptlib fresh-releases 2020-12-29T11:55 41s UScan failed to run: In directory ., downloading https://gitweb.torproject.org/pluggable-transports/goptlib.git/snapshot/v1.1.0.tar.gz failed: 400 Bad request.
golang-pault-go-topsort fresh-releases 2020-12-25T04:29 14s UScan failed to run: remote: Not Found.
golang-starlark fresh-releases 2020-12-01T06:42 11s UScan failed to run: remote: Not Found.
golang-text fresh-releases 2020-12-29T08:37 22s UScan failed to run: uscan warning: In /tmp/tmpktkrv7uv/debian/watch, no matching refs for watch line https://github.com/kr/text refs/tags/v?(?:[-_]?(\d[\-+\.:\~\da-zA-Z]*)) debian.
gradle fresh-releases 2021-04-30T23:32 27m26s UScan failed to run: Can't write to '/tmp/tmp154qh6w7/container/gradle-7.0-src.zip': No space left on device at /usr/share/perl5/LWP/Protocol.pm line 124..
greenbone-security-assistant fresh-releases 2021-04-24T05:02 8m0s UScan failed to run: uupdate: debian/source/format is "3.0 (quilt)"..
gui-ufw fresh-releases 2020-12-27T08:53 52s UScan failed to run: uscan error: Could not read /tmp/tmp43rdpu5t/container//costales/gufw/archive/21.04.0.tar.gz: No such file or directory.
gwyddion fresh-releases 2021-04-24T11:00 2m5s UScan failed to run: In directory ., downloading https://qa.debian.org/watch/sf.php/gwyddion/gwyddion-2.58.tar.xz failed: 500 Can't connect to deac-fra.dl.sourceforge.net:443.
gxkb fresh-releases 2020-08-30T18:59 50s UScan failed to run: uscan: error: sh debian/repack.stub --upstream-version 0.8.2 /home/janitor/tmp/tmpc1mmrtgb/container/gxkb_0.8.2.orig.tar.gz subprocess returned exit status 1 .
haskell-extra fresh-releases 2021-03-29T21:14 2m26s UScan failed to run: In watchfile /tmp/tmpsuvzpajo/debian/watch, reading webpage https://hackage.haskell.org/package/extra/distro-monitor failed: 502 Bad Gateway.
haskell-hslua-module-system fresh-releases 2021-03-29T21:24 2m43s UScan failed to run: In watchfile /tmp/tmpzfrf5nln/debian/watch, reading webpage https://hackage.haskell.org/package/hslua-module-system/distro-monitor failed: 502 Bad Gateway.
haskell-pointed fresh-releases 2021-03-29T21:13 2m27s UScan failed to run: In watchfile /tmp/tmpg1duhmyr/debian/watch, reading webpage https://hackage.haskell.org/package/pointed/distro-monitor failed: 502 Bad Gateway.
haskell-tabular fresh-releases 2021-03-29T21:25 2m39s UScan failed to run: In watchfile /tmp/tmpeu6976gu/debian/watch, reading webpage https://hackage.haskell.org/package/tabular/distro-monitor failed: 502 Bad Gateway.
helm-projectile fresh-releases 2020-12-01T04:59 14s UScan failed to run: uscan warning: In /tmp/tmpjsafjcr5/debian/watch, no matching refs for watch line https://github.com/bbatsov/helm-projectile refs/tags/v([\d\.\d\.]+) debian.
herisvm fresh-releases 2020-12-15T21:53 41s UScan failed to run: uscan error: Could not read /home/janitor/tmp/tmpjgb4sg_n/container/https://github.com/cheusov/herisvm/archive/0.9.0.tar.gz: No such file or directory.
hessian fresh-releases 2020-08-30T20:59 18s UScan failed to run: In watchfile /home/janitor/tmp/tmp2iuyst4j/debian/watch, reading webpage http://repo1.maven.org/maven2/com/caucho/hessian/ failed: 501 HTTPS Required.
hfsprogs fresh-releases 2021-01-19T18:33 30s UScan failed to run: uscan error: Parameter /tmp/tmpc_oq6sq8/container/diskdev_cmds-667.40.1 does not look like a tar archive or a zip file..
inform-mode fresh-releases 2020-12-18T17:53 45s UScan failed to run: uupdate: debian/source/format isn't "3.0 (quilt)"..
intellij-community-idea fresh-releases 2021-01-25T06:00 1h5m UScan failed to run: uscan warning: In /tmp/tmp93fisjgb/debian/watch, no matching refs for watch line https://github.com/JetBrains/intellij-community refs/tags/idea/([\d\.]+).
iptables fresh-releases 2020-11-20T13:35 48s UScan failed to run: In watchfile /home/janitor/tmp/tmp8wb2yfrq/debian/watch, reading webpage http://netfilter.org/projects/iptables/files/ failed: 403 Forbidden.
j4-dmenu-desktop fresh-releases 2020-08-30T19:42 28s UScan failed to run: FAIL Checking OpenPGP signature (no signature file downloaded). .
jackson-jr fresh-releases 2020-08-23T06:37 48s UScan failed to run: uscan error: Could not read /home/janitor/tmp/tmplckenwhz/container//FasterXML/jackson-jr/archive/jackson-jr-parent-2.11.2.tar.gz: No such file or directory .
jalview fresh-releases 2021-04-24T02:34 29s UScan failed to run: In directory ., downloading https://www.jalview.org/jalview_2_11_1_4.tar.gz failed: 404 Not Found.
janino fresh-releases 2020-08-30T18:49 21s UScan failed to run: svn: E170013: Unable to connect to a repository at URL 'https://svn.codehaus.org/janino/tags/janino_2.7.3' svn: E670002: Name or service not known uscan: error: debian/orig-tar.sh --upstream-version 2.7.3 /home/janitor/tmp/tmp_4w2cab2/container/janino_2.7.3.orig.tar.xz subprocess returned exit status 1 .
jasypt fresh-releases 2020-08-30T18:48 35s UScan failed to run: svn: E170000: URL 'http://svn.code.sf.net/p/jasypt/code/tags/jasypt/jasypt-1.9.3' doesn't exist uscan: error: debian/orig-tar.sh --upstream-version 1.9.3 /home/janitor/tmp/tmp3tu_3__v/container/jasypt_1.9.3.orig.tar.xz subprocess returned exit status 1 .
jenkins-trilead-ssh2 fresh-releases 2020-08-30T19:09 24s UScan failed to run: uscan: error: jh_repack --upstream-version -217-jenkins-23 /home/janitor/tmp/tmpwu1u4baj/container/jenkins-trilead-ssh2_-217-jenkins-23.orig.tar.gz subprocess returned exit status 1 .
jericho-html fresh-releases 2020-08-30T19:10 39s UScan failed to run: End-of-central-directory signature not found. Either this file is not a zipfile, or it constitutes one disk of a multi-part archive. In the latter case the central directory and zipfile comment will be found on the last disk(s) of this archive. unzip: cannot find zipfile directory in one of /home/janitor/tmp/tmpk4c1pvrm/container/jericho-html_3.4.orig.tar.xz or /home/janitor/tmp/tmpk4c1pvrm/container/jericho-html_3.4.orig.tar.xz.zip, and cannot find /home/janitor/tmp/tmpk4c1pvrm/container/jericho-html_3.4.orig.tar.xz.ZIP, period. uscan: error: debian/orig-tar.sh --upstream-version 3.4 /home/janitor/tmp/tmpk4c1pvrm/container/jericho-html_3.4.orig.tar.xz subprocess returned exit status 9 .
jinput fresh-releases 2020-12-01T03:32 23s UScan failed to run: uscan warning: In /tmp/tmp1h6olt82/debian/watch, no matching refs for watch line https://github.com/jinput/jinput refs/tags/([\d\.]+).
jline3 fresh-releases 2020-12-27T10:48 30s UScan failed to run: uscan warning: In /tmp/tmpuprezztg/debian/watch, no matching refs for watch line https://github.com/jline/jline3 refs/tags/.*-([\d\.]+).
jmagick fresh-releases 2020-08-30T18:44 25s UScan failed to run: uscan warn: unknown protocol for LWP: #http://downloads.jmagick.org/ uscan error: Parameter /home/janitor/tmp/tmpqgb5ltwh/container/6.6.9 does not look like a tar archive or a zip file. .
jsbundle-web-interfaces fresh-releases 2020-11-28T08:03 13s UScan failed to run: remote: Not Found.
kcm-fcitx5 fresh-releases 2020-12-29T06:53 52s UScan failed to run: uscan warning: In /tmp/tmpkdr2ibua/debian/watch, no matching refs for watch line https://github.com/fcitx/fcitx5-configtool refs/tags/(?:[-_]?(\d[\-+\.:\~\da-zA-Z]*)) debian.
kdgcommons-java fresh-releases 2020-08-30T19:33 38s UScan failed to run: uscan error: Parameter /home/janitor/tmp/tmpz92rcnt8/container/rel_1_0_17 does not look like a tar archive or a zip file. .
knights fresh-releases 2021-04-22T04:45 30s UScan failed to run: In directory ., downloading https://download.kde.org/stable/release-service/20.12.3/src/knights-20.12.3.tar.xz failed: 500 Can't connect to chernabog.cc.vt.edu:443 (Name or service not known).
kup-backup fresh-releases 2020-08-23T10:37 38s UScan failed to run: uscan error: Could not read /home/janitor/tmp/tmpvcpxzz9_/container//spersson/Kup/archive/kup-0.7.3.tar.gz: No such file or directory .
libapache-poi-java fresh-releases 2020-08-30T18:31 4m23s UScan failed to run: uscan warn: Possible OpenPGP signature found at: https://archive.apache.org/dist/poi/release/src/poi-src-4.1.2-20200217.tar.gz.asc * Add opts=pgpsigurlmangle=s/$/.asc/ or opts=pgpmode=auto to debian/watch * Add debian/upstream/signing-key.asc. See uscan(1) for more details svn: E170000: URL 'http://svn.apache.org/repos/asf/poi/tags/REL_4_1_2_FINAL' doesn't exist uscan: error: debian/orig-tar.sh --upstream-version 4.1.2 /home/janitor/tmp/tmpweo2zceu/container/libapache-poi-java_4.1.2.orig.tar.gz subprocess returned exit status 1 .
libaxiom-java fresh-releases 2020-08-30T19:34 55s UScan failed to run: uscan error: Parameter /home/janitor/tmp/tmpvm02qw7m/container/1.2.22 does not look like a tar archive or a zip file. .
libdmapsharing fresh-releases 2020-10-31T00:38 45s UScan failed to run: In watchfile /home/janitor/tmp/tmpegrk1o_z/debian/watch, reading webpage https://www.flyn.org/projects/libdmapsharing/download.html failed: 404 Not Found.
libgwenhywfar fresh-releases 2020-11-27T17:27 2m33s UScan failed to run: uscan error: Could not read /tmp/tmpsxl010li/container//rdm/attachments/download/344/libgwenhywfar-5.4.1.tar.gz: No such file or directory.
libice fresh-releases 2020-09-09T13:16 2m49s UScan failed to run: In watchfile /home/janitor/tmp/tmpka2ounso/debian/watch, reading webpage http://xorg.freedesktop.org/releases/individual/lib/ failed: 500 Can't connect to xorg.freedesktop.org:80 (Network is unreachable).
libisnativec-java fresh-releases 2020-08-30T18:35 5m12s UScan failed to run: End-of-central-directory signature not found. Either this file is not a zipfile, or it constitutes one disk of a multi-part archive. In the latter case the central directory and zipfile comment will be found on the last disk(s) of this archive. unzip: cannot find zipfile directory in one of /home/janitor/tmp/tmpunr4a3l3/container/libisnativec-java_5.6.20131203.orig.tar.xz or /home/janitor/tmp/tmpunr4a3l3/container/libisnativec-java_5.6.20131203.orig.tar.xz.zip, and cannot find /home/janitor/tmp/tmpunr4a3l3/container/libisnativec-java_5.6.20131203.orig.tar.xz.ZIP, period. uscan: error: debian/orig-tar.sh --upstream-version 5.6.20131203 /home/janitor/tmp/tmpunr4a3l3/container/libisnativec-java_5.6.20131203.orig.tar.xz subprocess returned exit status 9 .
libjgroups-java fresh-releases 2020-08-30T19:00 52s UScan failed to run: gzip: stdin: not in gzip format tar: Child returned status 1 tar: Error is not recoverable: exiting now uscan: error: debian/orig-tar.sh --upstream-version 5.0.0 /home/janitor/tmp/tmp2i2e566h/container/libjgroups-java_5.0.0.orig.tar.xz subprocess returned exit status 2 .
libjibx1.2-java fresh-releases 2020-08-30T19:31 1m28s UScan failed to run: End-of-central-directory signature not found. Either this file is not a zipfile, or it constitutes one disk of a multi-part archive. In the latter case the central directory and zipfile comment will be found on the last disk(s) of this archive. unzip: cannot find zipfile directory in one of /home/janitor/tmp/tmp7gls9c08/container/libjibx1.2-java_1.3.3.orig.tar.xz or /home/janitor/tmp/tmp7gls9c08/container/libjibx1.2-java_1.3.3.orig.tar.xz.zip, and cannot find /home/janitor/tmp/tmp7gls9c08/container/libjibx1.2-java_1.3.3.orig.tar.xz.ZIP, period. uscan: error: debian/orig-tar.sh --upstream-version 1.3.3 /home/janitor/tmp/tmp7gls9c08/container/libjibx1.2-java_1.3.3.orig.tar.xz subprocess returned exit status 9 .
libmpack-lua fresh-releases 2020-12-26T14:43 17s UScan failed to run: uupdate: cannot find debian/rules..
libosip2 fresh-releases 2021-01-21T13:42 42s UScan failed to run: http://ftp.gnu.org/gnu/osip/libosip2-5.2.0.tar.gz.sig.
librsl fresh-releases 2020-08-30T20:27 2m54s UScan failed to run: In watch file /home/janitor/tmp/tmpo5przu4a/debian/watch, reading FTP directory ftp://trmm-fc.gsfc.nasa.gov/software/ failed: 500 Network is unreachable.
libsequence-library-java fresh-releases 2020-08-30T18:13 21s UScan failed to run: uscan error: Parameter /home/janitor/tmp/tmpw9yyxjm8/container/1.0.4 does not look like a tar archive or a zip file. .
libslf4j-java fresh-releases 2020-08-30T20:22 44s UScan failed to run: In watchfile /home/janitor/tmp/tmp783qwe8j/debian/watch, reading webpage http://www.slf4j.org/dist/ failed: 404 Not Found.
libsml fresh-releases 2020-12-15T08:42 9s UScan failed to run: remote: Not Found.
libtrove-intellij-java fresh-releases 2021-01-21T16:42 12s UScan failed to run: remote: Not Found.
libtruth-java fresh-releases 2021-03-29T10:52 42s UScan failed to run: uscan error: Could not read /home/janitor/tmp/tmpvko045xs/container/https://github.com/google/truth/archive/refs/tags/release_1_1_2.tar.gz: No such file or directory.
libubootenv fresh-releases 2020-12-26T16:29 24s UScan failed to run: Cloning into bare repository '/tmp/tmp_lh84vr6/container/libubootenv-temporary.3408.git'....
libxbean-java fresh-releases 2020-08-30T19:00 21s UScan failed to run: uscan error: Parameter /home/janitor/tmp/tmpve08vpau/container/xbean-4.17 does not look like a tar archive or a zip file. .
log4cplus fresh-releases 2020-11-18T12:01 2m5s UScan failed to run: FAIL Checking OpenPGP signature (no signature file downloaded). .
lookatme fresh-releases 2021-01-19T17:16 1m7s UScan failed to run: In watchfile /home/janitor/tmp/tmpbx64dqgu/debian/watch, reading webpage https://github.com/d0c-s4vage/lookatme/releases failed: 500 Can't connect to github.com:443 (Connection timed out).
love fresh-releases 2021-04-24T17:17 19s UScan failed to run: In watchfile /tmp/tmpnfoq9kj9/debian/watch, reading webpage https://bitbucket.org/rude/love/downloads/ failed: 404 Not Found.
mariadb-connector-odbc fresh-releases 2020-11-30T20:14 24s UScan failed to run: In /tmp/tmpj3pmggyd/debian/watch no matching dirs for pattern ftp://ftp.osuosl.org/pub/mariadb/connector-odbc-(.*).
maven-bundle-plugin fresh-releases 2021-01-19T14:05 57s UScan failed to run: https://archive.apache.org/dist/felix/maven-bundle-plugin-5.1.1-source-release.tar.gz.asc.
maven-ejb-plugin fresh-releases 2020-12-27T07:28 16s UScan failed to run: uscan error: Parameter /tmp/tmp3lsv8j2c/container/maven-ejb-plugin-3.0.0 does not look like a tar archive or a zip file..
maven-remote-resources-plugin fresh-releases 2021-03-29T10:24 17s UScan failed to run: In directory ., downloading https://downloads.apache.org/maven/maven-remote-resources-plugin-1.7.0-source-release.zip failed: 404 Not Found.
mikutter fresh-releases 2020-12-02T07:29 1m8s UScan failed to run: In directory ., downloading https://mikutter.hachune.net/bin/mikutter.hachune.net/../bin/mikutter-4.1.2.tar.gz failed: 404 Not Found.
minetest fresh-releases 2020-09-06T04:43 7m54s UScan failed to run: tar: ..//home/janitor/tmp/tmpwyaz53qn/container/minetest_5.3.0.orig.tar.gz: Cannot open: No such file or directory.
mockldap fresh-releases 2020-11-27T09:44 1m35s UScan failed to run: FAIL Checking OpenPGP signature (no signature file downloaded). .
mojarra fresh-releases 2020-12-01T02:34 1m19s UScan failed to run: uscan error: Parameter /tmp/tmpc27djapf/container/2.4.0 does not look like a tar archive or a zip file..
monobristol fresh-releases 2020-12-27T04:01 1m6s UScan failed to run: In directory ., downloading http://dacr.hu/monobristol/monobristol-0.60.3.2.tar.gz failed: 404 Not Found.
mozilla-noscript fresh-releases 2020-12-15T10:33 59s UScan failed to run: https://addons.mozilla.org/en-US/firefox/addon/noscript/ https://addons.mozilla.org/firefox/downloads/file/\d+/noscript_security_suite-(\d+(?:\.\d+){1,3}(?:\w+\d+)?)-[+\w]+\.xpi\?src=dp-btn-\w+.
mp4parser fresh-releases 2020-12-27T08:05 1m18s UScan failed to run: uscan warning: In /tmp/tmpad7tykfk/debian/watch, no matching refs for watch line https://github.com/sannies/mp4parser refs/tags/mp4parser-project-(.*).
mplayer fresh-releases 2020-08-30T19:05 1m28s UScan failed to run: FAIL Checking OpenPGP signature (no signature file downloaded). .
musescore3 fresh-releases 2021-01-19T17:56 19m18s UScan failed to run: debian/repack: Error! github.com repository not found in debian/watch!.
mypaint fresh-releases 2020-11-30T05:48 4m33s UScan failed to run: FAIL Checking OpenPGP signature (no signature file downloaded). .
nfoview fresh-releases 2020-08-23T06:38 38s UScan failed to run: Cloning into bare repository '/home/janitor/tmp/tmpc1kt3xup/container/nfoview-temporary.1541469.git'... fatal: not a git repository: '../nfoview-temporary.1541469.git' uscan: error: git --git-dir ../nfoview-temporary.1541469.git show-ref refs/tags/1.28 subprocess returned exit status 128 .
node-console-browserify fresh-releases 2021-03-29T04:35 21s UScan failed to run: Unable to read ./package.json, skipping current version.
node-cors fresh-releases 2021-04-06T18:41 16s UScan failed to run: Unable to read ./package.json, skipping current version.
node-decamelize fresh-releases 2021-04-07T01:22 14s UScan failed to run: Unable to read ./package.json, skipping current version.
node-node-sass fresh-releases 2020-12-15T11:57 36s UScan failed to run: remote: Not Found.
node-pascalcase fresh-releases 2020-11-30T17:45 1m16s UScan failed to run: uscan error: Could not read /home/janitor/tmp/tmprx7sao4c/container/https://github.com/jonschlinkert/pascalcase/archive/1.0.0.tar.gz: No such file or directory.
node-pikaday fresh-releases 2021-03-29T06:03 23s UScan failed to run: Unable to read ./package.json, skipping current version.
node-raw-loader fresh-releases 2021-04-09T09:37 14s UScan failed to run: Unable to read ./package.json, skipping current version.
node-xmldom fresh-releases 2021-03-29T05:34 1m32s UScan failed to run: Unable to read ./package.json, skipping current version.
nomacs fresh-releases 2020-12-27T03:43 2m7s UScan failed to run: cp: cannot stat '/tmp/tmp.lA7AO6ceYN/nomacs-3.17.2206/Readme/LICENSE.GPLv3': No such file or directory.
openmx fresh-releases 2020-12-15T14:02 1m13s UScan failed to run: + UPSTREAM_VERSION=3.9.2.
openxr-sdk-source fresh-releases 2020-11-18T00:03 21s UScan failed to run: FAIL Checking OpenPGP signature (no signature file downloaded). .
ots fresh-releases 2020-11-30T11:16 1m49s UScan failed to run: uscan error: Parameter /home/janitor/tmp/tmpnzlftmb2/container/FakeWatchNoUpstreamSiteForThisPackage-0.No-Site.gz does not look like a tar archive or a zip file..
palabos fresh-releases 2021-04-24T17:25 35s UScan failed to run: In watchfile /tmp/tmpvexnc2ss/debian/watch, reading webpage https://www.palabos.org/download-ql failed: 500 Can't connect to palabos.unige.ch:443 (SSL connect attempt failed error:1414D172:SSL routines:tls12_check_peer_sigalg:wrong signature type).
pci.ids fresh-releases 2020-11-03T12:16 39s UScan failed to run: remote: Not Found.
pekka-kana-2 fresh-releases 2020-11-19T22:22 49s UScan failed to run: FAIL Checking OpenPGP signature (no signature file downloaded). .
pentobi fresh-releases 2021-04-03T10:46 46s UScan failed to run: FAIL Checking OpenPGP signature (no signature file downloaded). .
perl-doc-html fresh-releases 2020-08-30T20:21 1m1s UScan failed to run: In watchfile /home/janitor/tmp/tmps7ztlpo4/debian/watch, reading webpage https://qa.debian.org/cgi-bin/fakeupstream.cgi?package=perl-doc-html failed: 500 Internal Server Error.
phppgadmin fresh-releases 2020-12-15T14:08 22s UScan failed to run: uscan warning: In /tmp/tmpta5iofxk/debian/watch, no matching refs for watch line https://github.com/phppgadmin/phppgadmin refs/tags/REL_([\d-]+).
pikepdf fresh-releases 2020-09-20T03:59 33s UScan failed to run: uscan warning: In /tmp/tmpqm4zz1sx/debian/watch, no matching refs for watch line https://github.com/pikepdf/pikepdf refs/tags/v([\d\.\d\.]+) debian.
pmix fresh-releases 2021-04-04T21:18 3m1s UScan failed to run: uscan error: Could not read /tmp/tmpzi8vajom/container/https://github.com/openpmix/openpmix/archive/refs/tags/v4.0.0rc3.tar.gz: No such file or directory.
privacybadger fresh-releases 2020-12-25T13:44 1m19s UScan failed to run: uscan error: Could not read /tmp/tmpq9z054t2/container//EFForg/privacybadger/archive/release-2020.12.10.tar.gz: No such file or directory.
prometheus-mailexporter fresh-releases 2020-12-26T02:56 8s UScan failed to run: remote: Not Found.
pt-websocket fresh-releases 2020-12-02T02:49 35s UScan failed to run: In directory ., downloading https://gitweb.torproject.org/pluggable-transports/websocket.git/snapshot/v0.4.0.tar.gz failed: 400 Bad request.
pycuda fresh-releases 2020-11-28T04:47 19s UScan failed to run: Cloning into bare repository '/tmp/tmp_gd8gjsd/container/pycuda-temporary.26787.git'....
python-libzim fresh-releases 2021-01-19T18:28 1m18s UScan failed to run: In watchfile /home/janitor/tmp/tmp49m90p0h/debian/watch, reading webpage https://pypi.debian.net/libzim/ failed: 500 Can't connect to pypi.debian.net:443 (Network is unreachable).
python-peachpy fresh-releases 2020-12-29T08:10 17s UScan failed to run: remote: Not Found.
qstopmotion fresh-releases 2020-11-28T05:18 2m5s UScan failed to run: In directory ., downloading https://qa.debian.org/watch/sf.php/qstopmotion/qstopmotion-2.5.1-Source.tar.gz failed: 500 read timeout.
qtcharts-opensource-src fresh-releases 2021-01-21T13:56 41s UScan failed to run: In watch file /tmp/tmp4paxyepc/debian/watch, reading webpage https://download.qt.io/official_releases/qt/ failed: 500 Can't connect to download.qt.io:443 (Connection timed out).
qtscxml-everywhere-src fresh-releases 2021-01-19T20:38 1m13s UScan failed to run: In watch file /tmp/tmpvyaue_iv/debian/watch, reading webpage https://download.qt.io/official_releases/qt/ failed: 500 Can't connect to download.qt.io:443.
qtwebsockets-opensource-src fresh-releases 2021-01-19T12:04 51s UScan failed to run: In watch file /tmp/tmpbs2szef6/debian/watch, reading webpage https://download.qt.io/official_releases/qt/ failed: 500 Can't connect to download.qt.io:443.
rabit fresh-releases 2021-01-19T19:11 21s UScan failed to run: remote: Not Found.
racket-mode fresh-releases 2020-12-15T09:42 13s UScan failed to run: remote: Not Found.
recommonmark fresh-releases 2021-04-24T11:26 28s UScan failed to run: FAIL Checking OpenPGP signature (no signature file downloaded). .
reptyr fresh-releases 2021-04-04T17:05 5s UScan failed to run: In watchfile /tmp/tmpx1u6hndq/debian/watch, reading webpage http://githubredir.debian.net/github/nelhage/reptyr/ failed: 500 Can't connect to githubredir.debian.net:80 (Name or service not known).
rhino fresh-releases 2020-11-30T21:25 6m2s UScan failed to run: uscan warning: In /tmp/tmpczkod1mu/debian/watch, no matching refs for watch line https://github.com/mozilla/rhino refs/tags/Rhino([\d_.R]+)_(?:RELEASE|Release).
roundcube fresh-releases 2021-04-24T11:09 2m49s UScan failed to run: uscan warning: In debian/watch no matching refs for version 1.5 in watch line https://github.com/roundcube/roundcubemail.git refs/tags/v?(?:[-_]?(\d[\-+\.:\~\da-zA-Z]*)) debian debian/uupdate.
rpmlint fresh-releases 2020-08-30T18:45 52s UScan failed to run: uscan error: Could not read /home/janitor/tmp/tmpfa7qlxug/container//rpm-software-management/rpmlint/archive/rpmlint-1.11.tar.gz: No such file or directory .
rt-tests fresh-releases 2020-08-23T02:55 39s UScan failed to run: In directory ., downloading https://www.kernel.org/pub/linux/utils/rt-tests/rt-tests-1.8.tar.xz failed: 500 Can't connect to mirrors.edge.kernel.org:443 (Network is unreachable).
ruby-distribution fresh-releases 2020-11-28T09:51 22s UScan failed to run: redirecting DEPRECATED pkg-ruby-extras.alioth.debian.org/cgi-bin/gemwatch to gemwatch.debian.net.
ruby-github-markup fresh-releases 2020-08-30T19:09 27s UScan failed to run: uscan error: Could not read /home/janitor/tmp/tmpj7gxqh7b/container/https://gemwatch.debian.net/download/github-markup-3.0.4.tar.gz: No such file or directory .
ruby-money fresh-releases 2020-11-27T22:28 36s UScan failed to run: In watchfile /tmp/tmpss_455f0/debian/watch, reading webpage https://gemwatch.debian.net/money failed: 500 Can't connect to gemwatch.debian.net:443 (Network is unreachable).
ruby-sassc fresh-releases 2021-03-27T13:45 45s UScan failed to run: In watchfile /tmp/tmpqc4h9k8o/debian/watch, reading webpage https://gemwatch.debian.net/sassc failed: 500 Can't connect to gemwatch.debian.net:443 (Network is unreachable).
sagemath-database-elliptic-curves fresh-releases 2020-08-30T19:42 27s UScan failed to run: In directory ., downloading 0.8.1 failed: 400 URL must be absolute.
scala fresh-releases 2021-04-24T09:34 12m19s UScan failed to run: rm: cannot remove 'scala-2.13.5/src/scaladoc/scala/tools/nsc/doc/html/resource/lib/jquery.js': No such file or directory.
screeninfo fresh-releases 2021-01-19T17:23 1m13s UScan failed to run: In watchfile /home/janitor/tmp/tmpzvwsw1gg/debian/watch, reading webpage https://github.com/rr-/screeninfo/tags failed: 502 Bad Gateway.
sharness fresh-releases 2020-12-26T14:27 34s UScan failed to run: FAIL Checking OpenPGP signature (no keyring). .
smlnj fresh-releases 2020-08-30T19:35 1m44s UScan failed to run: uscan error: Parameter /home/janitor/tmp/tmpe4g8i5a7/container/index.html does not look like a tar archive or a zip file. .
snort fresh-releases 2020-11-30T12:17 2m7s UScan failed to run: In directory ., downloading https://www.snort.org/downloads/snort/snort-2.9.17.tar.gz failed: 500 Internal Server Error.
spice fresh-releases 2020-11-22T08:04 1m7s UScan failed to run: FAIL Checking OpenPGP signature (no signature file downloaded). .
svnkit fresh-releases 2020-08-30T18:58 36s UScan failed to run: End-of-central-directory signature not found. Either this file is not a zipfile, or it constitutes one disk of a multi-part archive. In the latter case the central directory and zipfile comment will be found on the last disk(s) of this archive. unzip: cannot find zipfile directory in one of /home/janitor/tmp/tmpe11tv7d9/container/svnkit_1.10.1.orig.tar.xz or /home/janitor/tmp/tmpe11tv7d9/container/svnkit_1.10.1.orig.tar.xz.zip, and cannot find /home/janitor/tmp/tmpe11tv7d9/container/svnkit_1.10.1.orig.tar.xz.ZIP, period. uscan: error: debian/orig-tar.sh --upstream-version 1.10.1 /home/janitor/tmp/tmpe11tv7d9/container/svnkit_1.10.1.orig.tar.xz subprocess returned exit status 9 .
systemfixtures fresh-releases 2020-11-28T08:16 23s UScan failed to run: FAIL Checking OpenPGP signature (no signature file downloaded). .
tensorpipe fresh-releases 2021-01-19T18:02 22s UScan failed to run: remote: Not Found.
timidity fresh-releases 2020-08-30T19:17 1m5s UScan failed to run: uscan: error: false --upstream-version 2.15.0 /home/janitor/tmp/tmp3_2fzb4o/container/timidity_2.15.0.orig.tar.bz2 subprocess returned exit status 1 .
tome fresh-releases 2020-08-30T19:18 58s UScan failed to run: uscan warn: Source format is earlier than 2.0, switch compression to gzip uupdate: debian/source/format isn't "3.0 (quilt)". uupdate: Skip auto-generating tome_2.41-ah~0.git.20200131-1.debian.tar.xz uscan: error: uupdate -f -b --upstream-version 2.4.0-ah subprocess returned exit status 1 .
trivial-features fresh-releases 2020-12-15T08:35 14s UScan failed to run: remote: Not Found.
trove fresh-releases 2020-11-28T08:20 43s UScan failed to run: tar: trove-*: Cannot stat: No such file or directory.
truffle fresh-releases 2020-12-15T12:50 12s UScan failed to run: uscan error: Parameter /tmp/tmpzihg9sd6/container/0.7 does not look like a tar archive or a zip file..
tryton-modules-account-invoice fresh-releases 2021-03-27T14:05 22s UScan failed to run: In watchfile /tmp/tmpnk6yes_r/debian/watch, reading webpage https://downloads.tryton.org/current/ failed: 500 Can't connect to downloads.tryton.org:443 (Network is unreachable).
tryton-modules-account-statement fresh-releases 2021-03-27T16:07 30s UScan failed to run: In watchfile /tmp/tmpv3h80kpj/debian/watch, reading webpage https://downloads.tryton.org/current/ failed: 500 Can't connect to downloads.tryton.org:443 (Network is unreachable).
tryton-modules-product-cost-fifo fresh-releases 2021-03-27T14:36 19s UScan failed to run: In watchfile /tmp/tmpz3ndr_si/debian/watch, reading webpage https://downloads.tryton.org/current/ failed: 500 Can't connect to downloads.tryton.org:443 (Network is unreachable).
tzdata fresh-releases 2020-10-12T21:41 1m16s UScan failed to run: In watch file /tmp/tmpuhn3d77x/debian/watch, reading FTP directory ftp://ftp.iana.org/tz/releases/ failed: 404 File 'releases' not found.
vdr-plugin-streamdev fresh-releases 2021-04-04T21:41 14s UScan failed to run: /tmp/tmpx36pptcx/debian/watch is an obsolete version 2 watch file; please upgrade to a higher version (see uscan(1) for details)..
velocity fresh-releases 2020-08-30T18:35 23s UScan failed to run: uscan error: Parameter /home/janitor/tmp/tmps2g11t60/container/2.2-RC5 does not look like a tar archive or a zip file. .
vim-julia fresh-releases 2021-01-21T13:55 30s UScan failed to run: remote: Not Found.
vim-youcompleteme fresh-releases 2020-09-04T00:10 45s UScan failed to run: remote: Not Found.
vine fresh-releases 2020-08-30T19:19 21s UScan failed to run: gpgv: Signature made Mon 01 Apr 2019 13:38:05 UTC gpgv: using RSA key 246C61675A0FB0E16A3E219C29C4F24992EDDC6D gpgv: Good signature from "Omer Katz <omer.drow@gmail.com>" uscan: error: sh debian/repack.stub --upstream-version 5.0.0~a1 /home/janitor/tmp/tmp0jr4avgx/container/vine_5.0.0~a1.orig.tar.gz subprocess returned exit status 1 .
weka fresh-releases 2020-08-30T18:46 1m37s UScan failed to run: + dpkg-parsechangelog + sed -ne s,Source: \(.*\),\1,p + SOURCE=weka + dpkg-parsechangelog + sed -ne s,^Version: \(.*\)-.*,\1,p + VERSION=3.6.14 + echo 3.8.4 + sed s/\./-/g + WEKADASHVERSION=3-8-4 + FILE=/home/janitor/tmp/tmpraphbpt3/container/weka_3.8.4.orig.tar.xz + DIR=weka-3-8-4/ + TAR=../weka_3.8.4.orig.tar.gz + unzip /home/janitor/tmp/tmpraphbpt3/container/weka_3.8.4.orig.tar.xz End-of-central-directory signature not found. Either this file is not a zipfile, or it constitutes one disk of a multi-part archive. In the latter case the central directory and zipfile comment will be found on the last disk(s) of this archive. unzip: cannot find zipfile directory in one of /home/janitor/tmp/tmpraphbpt3/container/weka_3.8.4.orig.tar.xz or /home/janitor/tmp/tmpraphbpt3/container/weka_3.8.4.orig.tar.xz.zip, and cannot find /home/janitor/tmp/tmpraphbpt3/container/weka_3.8.4.orig.tar.xz.ZIP, period. uscan: error: debian/orig-tar.sh --upstream-version 3.8.4 /home/janitor/tmp/tmpraphbpt3/container/weka_3.8.4.orig.tar.xz subprocess returned exit status 9 .
wims fresh-releases 2020-12-25T16:47 4m5s UScan failed to run: https://sourcesup.renater.fr/frs/download.php/file/6275/wims-4.21d.tgz.asc.
wireless-regdb fresh-releases 2020-08-23T02:45 41s UScan failed to run: In watchfile debian/watch, reading webpage https://www.kernel.org/pub/software/network/wireless-regdb/ failed: 500 Can't connect to mirrors.edge.kernel.org:443 (Network is unreachable).
wl-beta fresh-releases 2020-11-28T08:13 3m5s UScan failed to run: remote: Not Found.
wob fresh-releases 2020-12-26T14:03 12s UScan failed to run: FAIL Checking OpenPGP signature (no signature file downloaded). .
wxmaxima fresh-releases 2021-04-04T16:55 5m18s UScan failed to run: stop mangling: rule="auto" rule doesn't match "(s|tr|y)/.*/.*/[a-z]*" (or similar)..
x2gobroker fresh-releases 2021-01-19T13:09 1m8s UScan failed to run: In watchfile /tmp/tmp9_73vgzf/debian/watch, reading webpage https://code.x2go.org/releases/source/x2gobroker/ failed: 500 Can't connect to code.x2go.org:443 (certificate verify failed).
xbacklight fresh-releases 2020-08-30T19:37 13s UScan failed to run: In watchfile /home/janitor/tmp/tmpxh7r3o2r/debian/watch, reading webpage https://xorg.freedesktop.orgreleases/individual/app/ failed: 500 Can't connect to xorg.freedesktop.orgreleases:443 (Name or service not known).
xbitmaps fresh-releases 2020-09-20T00:21 16s UScan failed to run: In watchfile /tmp/tmp6y3ywdb2/debian/watch, reading webpage https://xorg.freedesktop.orgreleases/individual/data/ failed: 500 Can't connect to xorg.freedesktop.orgreleases:443 (Name or service not known).
xcb-imdkit fresh-releases 2020-11-28T07:02 20s UScan failed to run: uscan warning: In /tmp/tmpnvewhe7d/debian/watch, no matching refs for watch line https://github.com/fcitx/xcb-imdkit refs/tags/(?:[-_]?(\d[\-+\.:\~\da-zA-Z]*)) debian.
xdm fresh-releases 2020-08-30T19:37 25s UScan failed to run: In watchfile /home/janitor/tmp/tmpbwm6zckw/debian/watch, reading webpage https://xorg.freedesktop.orgreleases/individual/app/ failed: 500 Can't connect to xorg.freedesktop.orgreleases:443 (Name or service not known).
xsddiagram fresh-releases 2020-09-20T00:42 19s UScan failed to run: In watchfile /tmp/tmpi9fowuu8/debian/watch, reading webpage http://regis.cosnier.free.fr/soft/xsddiagram/ failed: 403 Forbidden.
xserver-xorg-video-tdfx fresh-releases 2019-08-25T17:59 25s UScan failed to run: OpenPGP signature did not verify..
youtube-dl fresh-releases 2020-11-13T05:35 3m55s UScan failed to run: In watchfile /home/janitor/tmp/tmpd81menyh/debian/watch, reading webpage https://github.com/ytdl-org/youtube-dl/releases failed: 451 Unavailable for Legal Reasons.